{"text_format":"3","workbook":"xlsx","n_sheets":18,"sheets":["PERFORACIONES","TUBERIA Y FLUIDO","TERRENO","METODO","C.T. DIRECTO","C.T. GRADOS DIA","BOMBA DE CALOR","RESULTADOS","SENSIBILIDAD","DIM CALEFACCION","DIM REFRIGERACIÓN","DATOS TUBERIAS","DATOS FLUIDOS","PROPIEDAD FLUIDOS","DATOS SUELOS","INGRESO TERRENO","coefficients","Instructions"],"not_rendered":{"charts":1,"images":9,"macros":1,"external_links":1,"defined_names":2},"read":"whole","date_system":"1900"}

{"sheet":"PERFORACIONES","index":0,"n_rows":169,"n_cols":12,"rows_kept":169,"merged":[[0,0,0,3]]}
["CONFIGURACIÓN DE PERFORACIONES",{"$nulls":5},1,1,"1; Lineal 1X1",1,1,"120; Matricial 12X10"]
[{"$nulls":6},2,2,"2; Lineal 2X1",2,1,"120; Matricial 15X8"]
["Tipo de perforación","Vertical",{"$nulls":4},3,3,"3; Lineal 3X1",3,1,"120; Matricial 20X6"]
["Número de perforaciones",81,120,{"$nulls":3},4,4,"4; Matricial 2X2",2,2,"120; Matricial 24X5"]
["Radio de perforacion",0.054,"m",{"$nulls":3},5,4,"4; Lineal 4X1",4,1,"120; Matricial 30X4"]
["Distancia entre perforaciones",6.096,"m",{"$nulls":3},6,5,"5; Lineal 5X1",5,1]
["Geometría de perforación",1,{"$nulls":4},7,6,"6; Matricial 3X2",3,2]
["Conductividad Térmica Mortero",1.73,"W/m°K",{"$nulls":3},8,6,"6; Lineal 6X1",6,1]
{"$rows_left_out":162}
{"sheet":"TUBERIA Y FLUIDO","index":1,"n_rows":13,"n_cols":11,"rows_kept":13,"merged":[[0,0,0,2],[0,3,0,6]]}
["SELECCIÓN TUBERIA",null,null,"SELECCIÓN FLUIDO",{"$nulls":3},{"$f":"B9","v":0.025},{"$f":"IF(B3=\"Polietileno\",\"PE32\",\"PB4\")","v":"PE32"},{"$f":"IF(B4=\"PE32\",\"PN4\",IF(OR(B4=\"PE50A\",B4=\"PE50B\",B4=\"PE80\",B4=\"PE100\"),\"PN6\",\"PN8\"))","v":"PN6"},{"$f":"IF(OR(AND(B4=\"PE50A\",B5=\"PN6\"),AND(B4=\"PE50A\",B5=\"PN16\"),AND(B4=\"PE50B\",B5=\"PN6\"),AND(B4=\"PE80\",B5=\"PN6\"),AND(B4=\"PE100\",B5=\"PN25\")),\"\",\"3/4''\")","v":""}]
[{"$nulls":7},{"$f":"B9+0.006","v":0.031},{"$f":"IF(B3=\"Polietileno\",\"PE50A\",\"PB5\")","v":"PE50A"},{"$f":"IF(B4=\"PE32\",\"PN6\",IF(OR(B4=\"PE50A\",B4=\"PE50B\",B4=\"PE80\",B4=\"PE100\"),\"PN10\",\"PN10\"))","v":"PN10"},{"$f":"IF(OR(AND(B4=\"PE50A\",B5=\"PN16\"),AND(B4=\"PE80\",B5=\"PN6\"),AND(B4=\"PB4\",B5=\"PN8\")),\"\",\"1''\")","v":"1''"}]
["Material","Polietileno",null,"Fluido","Agua/Propilenglicol",null,null,{"$f":"(2*PERFORACIONES!B5-2*B9)/3+B9","v":{"v":0.044333333333333336,"d":"0.044"}},{"$f":"IF(B3=\"Polietileno\",\"PE50B\",\"\")","v":"PE50B"},{"$f":"IF(B4=\"PE32\",\"PN10\",IF(OR(B4=\"PE50A\",B4=\"PE50B\",B4=\"PE100\"),\"PN16\",\"\"))","v":"PN16"},{"$f":"IF(OR(AND(B4=\"PE80\",B5=\"PN6\"),AND(B4=\"PB4\",B5=\"PN8\")),\"\",\"1 1/4''\")","v":"1 1/4''"}]
["Tipo","PE50A",null,"% en peso Anticongelante",20,"%",null,{"$f":"2*PERFORACIONES!B5-B9","v":{"v":0.08299999999999999,"d":"0.083"}},{"$f":"IF(B3=\"Polietileno\",\"PE80\",\"\")","v":"PE80"},{"$f":"IF(B4=\"PE100\",\"PN25\",\"\")","v":""},{"$f":"IF(OR(AND(B4=\"PB4\",B5=\"PN8\")),\"\",\"1 1/2''\")","v":"1 1/2''"}]
["Presión Nominal","PN6",null,"Temperatura media fluido",3,"°C",null,null,{"$f":"IF(B3=\"Polietileno\",\"PE100\",\"\")","v":"PE100"},null,{"$f":"IF(OR(AND(B4=\"PB4\",B5=\"PN8\"),AND(B4=\"PB4\",B5=\"PN10\")),\"\",\"2''\")","v":"2''"}]
["Diámetro Nominal","1''",null,"Flujo total del sistema",{"v":104400,"d":"104,400.0"},"l/h",{"$nulls":4},{"$f":"IF(OR(AND(B4=\"PB4\",B5=\"PN8\"),AND(B4=\"PB4\",B5=\"PN10\")),\"\",\"2 1/2''\")","v":"2 1/2''"}]
["Distancia centro-centro U-tube",{"v":0.044333333333333336,"d":"0.044"},"m","Flujo por perforación",{"$f":"E6/PERFORACIONES!C4","v":870},"l/h"]
["Diametro Interno",{"$f":"VLOOKUP(CONCATENATE(B3,B4,B5,B6),'DATOS TUBERIAS'!$A$2:$H$108,7,FALSE)/1000","v":0.021},"m","Densidad ",{"$f":"VLOOKUP(E3,'DATOS FLUIDOS'!$A$2:$G$4,4,FALSE)","v":{"v":1020.6313415097503,"d":"1,020.6"}},"kg/m3"]
{"$rows_left_out":6}
{"sheet":"TERRENO","index":2,"n_rows":7,"n_cols":3,"rows_kept":7,"merged":[[0,0,0,3]]}
["SELECCIÓN DEL TERRENO"]
[]
["Tipo Suelo","DEFINIDO POR EL USUARIO - Maxey Elementary School"]
["Temperatura imperturbable",12.41,"°C"]
["Conductividad Térmica",{"$f":"VLOOKUP($B$3,'DATOS SUELOS'!$A$4:$F$42,4,FALSE)","v":{"v":2.25,"d":"2.250"}},"W/m°K"]
["Capacidad Térmica",{"$f":"VLOOKUP($B$3,'DATOS SUELOS'!$A$4:$F$42,6,FALSE)","v":2.877},"MJ/m3°K"]
["Difusividad Térmica",{"$f":"B5*3600*24/(B6*1000000)","v":{"v":0.06757038581856101,"d":"0.068"}},"m2/día"]

{"sheet":"METODO","index":3,"n_rows":3,"n_cols":4,"rows_kept":3,"merged":[[0,0,0,4]]}
["SELECCIÓN MÉTODO INGRESO DE CARGAS TÉRMICAS"]
[]
[1,"MÉTODO DIRECTO",null,"MÉTODO GRADOS DÍA"]

{"sheet":"C.T. DIRECTO","index":4,"n_rows":14,"n_cols":8,"rows_kept":14,"merged":[[0,0,0,7]]}
["INGRESO CARGAS TÉRMICAS - METODO DIRECTO"]
["Mes","Total Calefacción\nkWh","Total Refrigeración\nkWh","Pot. Max. Calefacción\nkW","Pot. Max. Refrigeración\nkW","Calor Absorbido\nkWh","Calor Inyectado\nkWh"]
["Enero",{"v":100648.1,"d":"100,648.1"},{"v":1141.4,"d":"1,141.4"},{"v":523,"d":"523.0"},{"v":45,"d":"45.0"},{"v":74405,"d":"74,405.0"},3.1,31]
["Febrero",{"v":70481.7,"d":"70,481.7"},438.1,{"v":497,"d":"497.0"},{"v":17,"d":"17.0"},{"v":52175,"d":"52,175.0"},11.9,28]
["Marzo",{"v":42614.7,"d":"42,614.7"},{"v":3230.6,"d":"3,230.6"},{"v":496,"d":"496.0"},{"v":88,"d":"88.0"},{"v":29431.4,"d":"29,431.4"},{"v":1312.8,"d":"1,312.8"},31]
["Abril",{"v":20754.2,"d":"20,754.2"},{"v":7428.3,"d":"7,428.3"},{"v":265,"d":"265.0"},{"v":116,"d":"116.0"},{"v":12120.8,"d":"12,120.8"},{"v":5133.3,"d":"5,133.3"},30]
["Mayo",{"v":7797.8,"d":"7,797.8"},{"v":27101.9,"d":"27,101.9"},{"v":144,"d":"144.0"},{"v":276,"d":"276.0"},{"v":1790.8,"d":"1,790.8"},{"v":27950.6,"d":"27,950.6"},31]
["Junio",{"v":1871.4,"d":"1,871.4"},{"v":49993.1,"d":"49,993.1"},{"v":67,"d":"67.0"},{"v":442,"d":"442.0"},28.1,{"v":58388.3,"d":"58,388.3"},30]
{"$rows_left_out":7}
{"sheet":"C.T. GRADOS DIA","index":5,"n_rows":24,"n_cols":6,"rows_kept":24,"merged":[[0,0,0,5],[7,1,7,2],[7,3,7,4]]}
["INGRESO CARGAS TÉRMICAS - MÉTODO GRADOS DIAS"]
[]
["Coef. Volumétrico de pérdidas",null,"W/°C m3"]
["Volumen a climatizar",null,"m3"]
["Coef. Uso de la instalación"]
["Coef. Intermitencia instalación"]
[]
[null,"CALEFACCIÓN",null,"REFRIGERACIÓN"]
{"$rows_left_out":17}
{"sheet":"BOMBA DE CALOR","index":6,"n_rows":10,"n_cols":4,"rows_kept":10,"merged":[[0,0,0,4]]}
["CONFIGURACION BOMBA DE CALOR"]
[]
[null,"CALEFACCION","REFRIGERACION"]
["Temperatura Entrada Fluido",4.44,23.39,"°C"]
["COP Bomba de Calor",4,4.62]
["Potencia Nominal Bomba de Calor",598,772,"kW"]
["Potencia Máxima Demandada",{"$f":"IF(METODO!A3=1,MAX('C.T. DIRECTO'!$D$3:$D$14),'C.T. GRADOS DIA'!B3*'C.T. GRADOS DIA'!B4*('C.T. GRADOS DIA'!B9-'C.T. GRADOS DIA'!B10)/1000)","v":{"v":523,"d":"523.0"}},{"$f":"IF(METODO!A3=1,MAX('C.T. DIRECTO'!$E$3:$E$14),'C.T. GRADOS DIA'!B3*'C.T. GRADOS DIA'!B4*('C.T. GRADOS DIA'!D10-'C.T. GRADOS DIA'!D9)/1000)","v":{"v":442,"d":"442.0"}},"kW"]
["Carga máxima al terreno por hora",{"$f":"B7-B7/B5","v":{"v":392.25,"d":"392.3"}},{"$f":"C7+C7/C5","v":{"v":537.6709956709957,"d":"537.7"}},"kW"]
{"$rows_left_out":3}
{"sheet":"RESULTADOS","index":7,"n_rows":20,"n_cols":7,"rows_kept":20,"merged":[[0,0,0,7],[2,0,3,0],[5,0,7,0],[9,0,12,0],[14,0,15,0],[17,0,19,0]]}
["RESULTADOS"]
[{"$nulls":3},"CALEFACCIÓN",null,"REFRIGERACIÓN"]
["GENERAL","Longitud Total","L",{"$f":"IF(PERFORACIONES!B4=1,'DIM CALEFACCION'!D35,'DIM CALEFACCION'!E69)","v":{"v":10726.430962023094,"d":"10,726.4"}},null,{"$f":"IF(PERFORACIONES!B4=1,'DIM REFRIGERACIÓN'!D35,'DIM REFRIGERACIÓN'!E69)","v":{"v":9918.350304126796,"d":"9,918.4"}},"m"]
[null,"Longitud por Perforación","H",{"$f":"IF(PERFORACIONES!B4=1,'DIM CALEFACCION'!D35,'DIM CALEFACCION'!E70)","v":{"v":89.38692468352579,"d":"89.4"}},null,{"$f":"IF(PERFORACIONES!B4=1,'DIM REFRIGERACIÓN'!D35,'DIM REFRIGERACIÓN'!E70)","v":{"v":82.65291920105663,"d":"82.7"}},"m"]
[]
["TERRENO","Resistencia Térmica Terreno 6h","R6h",{"$f":"'DIM CALEFACCION'!D29","v":{"v":0.10067476876387128,"d":"0.101"}},null,{"$f":"'DIM REFRIGERACIÓN'!D29","v":{"v":0.10067476876387128,"d":"0.101"}},"m°K/W"]
[null,"Resistencia Térmica Terreno 1m","R1m",{"$f":"'DIM CALEFACCION'!D30","v":{"v":0.16000118229150292,"d":"0.160"}},null,{"$f":"'DIM REFRIGERACIÓN'!D30","v":{"v":0.16000118229150292,"d":"0.160"}},"m°K/W"]
[null,"Resistencia Térmica Terreno 10y","R10y",{"$f":"'DIM CALEFACCION'!D31","v":{"v":0.16963475236295308,"d":"0.170"}},null,{"$f":"'DIM REFRIGERACIÓN'!D31","v":{"v":0.16963475236295308,"d":"0.170"}},"m°K/W"]
{"$rows_left_out":13}
{"sheet":"SENSIBILIDAD","index":8,"n_rows":23,"n_cols":19,"rows_kept":23,"merged":[[0,1,0,3],[0,4,0,6],[0,7,0,9],[0,10,0,12],[0,13,0,15],[0,16,0,18]]}
[null,"Variación Distancia U-Tube",null,null,"Variación T° Imperturbable",null,null,"Variacion Distancia Entre Perforaciones",null,null,"Variacion Conductividad Termica mortero",null,null,"Variación Conductividad Termica Suelo",null,null,"Variación Capacidad Termica Suelo"]
["Delta Variable","Distancia U-Tube","Longitud Total","Delta Longitud","T° Imperturbable","Longitud Total","Delta Longitud","Distancia Entre Perforaciones","Longitud Total","Delta Longitud","Conductividad Termica mortero","Longitud Total","Delta Longitud","Conductividad Termica Suelo","Longitud Total","Delta Longitud","Capacidad Termica Suelo","Longitud Total","Delta Longitud"]
[{"v":-0.5,"d":"-50%"},{"$nulls":3},{"$f":"$E$13*(1+A3)","v":6.205},{"v":29596.862393120875,"d":"29596.9"},{"$f":"F3/$F$13-1","v":{"v":1.7592460621718913,"d":"175.9%"}},{"$f":"$H$13*(1+A3)","v":3.048},{"v":10993.207802478422,"d":"10993.2"},{"$f":"I3/$I$13-1","v":{"v":0.024870979116898395,"d":"2.5%"}},{"$f":"$K$13*(1+A3)","v":{"v":0.865,"d":"0.87"}},{"v":13806.617860249586,"d":"13806.6"},{"$f":"L3/$L$13-1","v":{"v":0.2871586000163415,"d":"28.7%"}},{"$f":"$N$13*(1+A3)","v":{"v":1.125,"d":"1.13"}},{"v":14832.607654461715,"d":"14832.6"},{"$f":"O3/$O$13-1","v":{"v":0.3828092220960104,"d":"38.3%"}},{"$f":"$Q$13*(1+A3)","v":{"v":1.4385,"d":"1.44"}},{"v":11745.339040435238,"d":"11745.3"},{"$f":"R3/$R$13-1","v":{"v":0.09499041032563249,"d":"9.5%"}}]
[{"v":-0.45,"d":"-45%"},{"$nulls":3},{"v":6.825500000000001,"d":"6.826"},{"v":25225.55862659089,"d":"25225.6"},{"$f":"F4/$F$13-1","v":{"v":1.3517196648076073,"d":"135.2%"}},{"v":3.3528000000000002,"d":"3.353"},{"v":10965.521402158303,"d":"10965.5"},{"$f":"I4/$I$13-1","v":{"v":0.022289840952848916,"d":"2.2%"}},{"v":0.9515,"d":"0.95"},{"v":13250.45537832247,"d":"13250.5"},{"$f":"L4/$L$13-1","v":{"v":0.23530887629218689,"d":"23.5%"}},{"v":1.2375,"d":"1.24"},{"v":14162.477589214166,"d":"14162.5"},{"v":0.3203345678871554,"d":"32.0%"},{"v":1.58235,"d":"1.58"},{"v":11603.068242392352,"d":"11603.1"},{"v":0.0817268375168767,"d":"8.2%"}]
[{"v":-0.4,"d":"-40%"},{"$f":"$B$13*(1+A5)","v":{"v":0.026600000000000002,"d":"0.027"}},{"v":11697.987665885044,"d":"11698.0"},{"$f":"C5/$C$13-1","v":{"v":0.09057595273784402,"d":"9.1%"}},7.446,{"v":21975.10152629918,"d":"21975.1"},{"v":1.0486871732174454,"d":"104.9%"},{"v":3.6576,"d":"3.658"},{"v":10938.040641070858,"d":"10938.0"},{"v":0.019727874052139827,"d":"2.0%"},{"v":1.038,"d":"1.04"},{"v":12785.932741470244,"d":"12785.9"},{"v":0.1920025203852811,"d":"19.2%"},{"v":1.3499999999999999,"d":"1.35"},{"v":13581.273477724784,"d":"13581.3"},{"v":0.26615027177345874,"d":"26.6%"},{"v":1.7261999999999997,"d":"1.73"},{"v":11473.68577220661,"d":"11473.7"},{"v":0.06966481328497531,"d":"7.0%"}]
[{"v":-0.35,"d":"-35%"},{"v":0.028816666666666668,"d":"0.029"},{"v":11546.75790445185,"d":"11546.8"},{"v":0.0764771567852458,"d":"7.6%"},{"v":8.0665,"d":"8.067"},{"v":19460.928859165768,"d":"19460.9"},{"v":0.8142967523929576,"d":"81.4%"},{"v":3.9624,"d":"3.962"},{"v":10910.772305525643,"d":"10910.8"},{"v":0.017185711086493694,"d":"1.7%"},{"v":1.1245,"d":"1.12"},{"v":12392.0193544005,"d":"12392.0"},{"v":0.15527889922327542,"d":"15.5%"},{"v":1.4625000000000001,"d":"1.46"},{"v":13071.986473590141,"d":"13072.0"},{"v":0.21867063889857508,"d":"21.9%"},{"v":1.87005,"d":"1.87"},{"v":11355.136859804099,"d":"11355.1"},{"v":0.05861277623535144,"d":"5.9%"}]
[{"v":-0.3,"d":"-30%"},{"v":0.031033333333333333,"d":"0.031"},{"v":11406.508613281248,"d":"11406.5"},{"v":0.06340204432079677,"d":"6.3%"},8.687,{"v":17456.941540720494,"d":"17456.9"},{"v":0.6274697149990298,"d":"62.7%"},{"v":4.2672,"d":"4.267"},{"v":10883.72328095363,"d":"10883.7"},{"v":0.014663993968490496,"d":"1.5%"},{"v":1.2109999999999999,"d":"1.21"},{"v":12053.677226993525,"d":"12053.7"},{"v":0.1237360562585581,"d":"12.4%"},{"v":1.575,"d":"1.58"},{"v":12621.736657252108,"d":"12621.7"},{"v":0.1766949045716455,"d":"17.7%"},{"v":2.0138999999999996,"d":"2.01"},{"v":11245.815916900277,"d":"11245.8"},{"v":0.048421041138106746,"d":"4.8%"}]
[{"v":-0.25,"d":"-25%"},{"v":0.03325,"d":"0.033"},{"v":11275.699574436818,"d":"11275.7"},{"v":0.05120702443882852,"d":"5.1%"},{"v":9.307500000000001,"d":"9.308"},{"v":15821.347484970589,"d":"15821.3"},{"v":0.47498711742853095,"d":"47.5%"},4.572,{"v":10856.900544944925,"d":"10856.9"},{"v":0.012163373202489947,"d":"1.2%"},{"v":1.2974999999999999,"d":"1.30"},{"v":11759.865837811709,"d":"11759.9"},{"v":0.0963447095727823,"d":"9.6%"},{"v":1.6875,"d":"1.69"},{"v":12220.583177118373,"d":"12220.6"},{"v":0.13929630651475056,"d":"13.9%"},{"v":2.15775,"d":"2.16"},{"v":11144.445438868957,"d":"11144.4"},{"v":0.03897050923329881,"d":"3.9%"}]
{"$rows_left_out":16}
{"sheet":"DIM CALEFACCION","index":9,"n_rows":70,"n_cols":6,"rows_kept":70,"merged":[[1,0,1,2],[2,5,4,5],[5,0,5,2],[9,0,9,2],[13,0,13,2],[22,0,22,2],[27,0,27,2],[31,0,31,2],[36,0,36,2],[41,0,41,2]]}
["PRIMER SET DE INPUTS",null,"UNIDADES","Perforación única","Multiples perforaciones"]
["Calor inyectado/absorbido"]
["Carga máxima al terreno por hora","qh","W",{"$f":"-'BOMBA DE CALOR'!B8*1000","v":-392250},{"$f":"D3","v":-392250},"Convención de signos:\n+: Calor inyectado al terreno\n-: Calor absorbido del terreno"]
["Carga máxima al terreno por mes","qm","W",{"$f":"-'BOMBA DE CALOR'!B9*1000","v":{"v":-100006.72043010753,"d":"-100007"}},{"$f":"D4","v":{"v":-100006.72043010753,"d":"-100007"}}]
["Carga al terreno por año","qy","W",{"$f":"-'BOMBA DE CALOR'!B10*1000","v":{"v":-1777.3515981735134,"d":"-1777"}},{"$f":"D5","v":{"v":-1777.3515981735134,"d":"-1777"}}]
["Propiedades del terreno"]
["Conductividad Térmica","k","W.m-1K-1",{"$f":"TERRENO!B5","v":2.25},{"$f":"D7","v":2.25}]
["Difusividad Térmica","α","m2.día-1",{"$f":"TERRENO!B7","v":{"v":0.06757038581856101,"d":"0.068"}},{"$f":"D8","v":{"v":0.06757038581856101,"d":"0.068"}},"<- Aviso: α debe estar entre el rango 0,025 y 0,2 m²/day"]
{"$rows_left_out":63}
{"sheet":"DIM REFRIGERACIÓN","index":10,"n_rows":70,"n_cols":6,"rows_kept":70,"merged":[[1,0,1,2],[2,5,4,5],[5,0,5,2],[9,0,9,2],[13,0,13,2],[22,0,22,2],[27,0,27,2],[31,0,31,2],[36,0,36,2],[41,0,41,2]]}
["PRIMER SET DE INPUTS",null,"UNIDADES","Perforación única","Multiples perforaciones"]
["Calor inyectado/absorbido"]
["Carga máxima al terreno por hora","qh","W",{"$f":"'BOMBA DE CALOR'!C8*1000","v":{"v":537670.9956709957,"d":"537671"}},{"$f":"D3","v":{"v":537670.9956709957,"d":"537671"}},"Convención de signos:\n+: Calor inyectado al terreno\n-: Calor absorbido del terreno"]
["Carga máxima al terreno por mes","qm","W",{"$f":"'BOMBA DE CALOR'!C9*1000","v":{"v":81094.86111111111,"d":"81095"}},{"$f":"D4","v":{"v":81094.86111111111,"d":"81095"}}]
["Carga al terreno por año","qy","W",{"$f":"'BOMBA DE CALOR'!C10*1000","v":{"v":1777.3515981735134,"d":"1777"}},{"$f":"D5","v":{"v":1777.3515981735134,"d":"1777"}}]
["Propiedades del terreno"]
["Conductividad Térmica","k","W.m-1K-1",{"$f":"TERRENO!B5","v":2.25},{"$f":"D7","v":2.25}]
["Difusividad Térmica","α","m2.día-1",{"$f":"TERRENO!B7","v":{"v":0.06757038581856101,"d":"0.068"}},{"$f":"D8","v":{"v":0.06757038581856101,"d":"0.068"}},"<- Aviso: α debe estar entre el rango 0,025 y 0,2 m²/day"]
{"$rows_left_out":63}
{"sheet":"DATOS TUBERIAS","index":11,"n_rows":130,"n_cols":8,"rows_kept":130}
[null,"Material","Tipo","Presión\n(Bar)","Diam Nominal\n(Pul)","DN=Do Exterior\n(mm)","Di Interior\n(mm)","Kp\n(W/m°K)"]
[{"$f":"CONCATENATE(B2,C2,\"PN\",D2,E2)","v":"PolietilenoPE32PN43/4''"},"Polietileno","PE32",4,"3/4''",20,17.6,0.40678]
[{"$f":"CONCATENATE(B3,C3,\"PN\",D3,E3)","v":"PolietilenoPE32PN41''"},"Polietileno","PE32",4,"1''",25,21,0.40678]
["PolietilenoPE32PN41 1/4''","Polietileno","PE32",4,"1 1/4''",32,28,0.40678]
["PolietilenoPE32PN41 1/2''","Polietileno","PE32",4,"1 1/2''",40,35.2,0.40678]
["PolietilenoPE32PN42''","Polietileno","PE32",4,"2''",50,44,0.40678]
["PolietilenoPE32PN42 1/2''","Polietileno","PE32",4,"2 1/2''",63,55.4,0.40678]
["PolietilenoPE32PN63/4''","Polietileno","PE32",6,"3/4''",20,16,0.40678]
{"$rows_left_out":123}
{"sheet":"DATOS FLUIDOS","index":12,"n_rows":33,"n_cols":7,"rows_kept":33,"merged":[[16,0,16,6],[25,0,25,6]]}
["Tipo","T° Media\n°C","Punto Congelamiento\n°C","Densidad\nkg/m3","Capacidad Térmica\nJ/kg°K","Conductividad\nW/m°K","Viscosidad\nPa s"]
["Agua Pura",20,0,998.1,4173,0.5929,0.001002]
["Agua/Etilenglicol",{"$f":"B8-273.15","v":3},{"$f":"B15-273.15","v":-7.72358939999998},{"$f":"B10","v":{"v":1035.4248926930868,"d":"1035.4"}},{"$f":"B11*1000","v":{"v":3826.4292948451307,"d":"3826.4"}},{"$f":"B12","v":{"v":0.5031977823467573,"d":"0.503"}},{"$f":"B13","v":{"v":0.003023892205300148,"d":"0.003024"}}]
["Agua/Propilenglicol",{"$f":"C8-273.15","v":3},{"$f":"C15-273.15","v":-6.416839799999991},{"$f":"C10","v":{"v":1020.6313415097503,"d":"1020.6"}},{"$f":"C11*1000","v":{"v":3975.830120157048,"d":"3975.8"}},{"$f":"C12","v":{"v":0.49208168894700677,"d":"0.492"}},{"$f":"C13","v":{"v":3.8926621068957968E-3,"d":"0.003893"}}]
[]
["Mezcla con","Etilenglicol","Propilenglico"]
["% Peso de la solución",{"$f":"'TUBERIA Y FLUIDO'!E4/100","v":0.2},{"$f":"'TUBERIA Y FLUIDO'!E4/100","v":0.2}]
["Temperatura media del fluido",{"$f":"'TUBERIA Y FLUIDO'!E5+273.15","v":276.15},{"$f":"'TUBERIA Y FLUIDO'!E5+273.15","v":276.15},"[K]"]
{"$rows_left_out":26}
{"sheet":"PROPIEDAD FLUIDOS","index":13,"n_rows":54,"n_cols":11,"rows_kept":54}
["Forced Convection Heat Transfer Coefficient Correlations   (S.I. units)",{"$nulls":8},"      Equations for Forced Convection Flow inside Pipes"]
[]
["1. Turbulent Flow Inside a Circular Tube"]
[]
["Inputs",{"$nulls":4},"Calculations"]
[]
["Fluid =",{"$f":"'TUBERIA Y FLUIDO'!E3","v":"Agua/Propilenglicol"},{"$nulls":3},"Reynolds Number, Re =",null,{"$f":"C13*C16*C18/C20","v":{"v":3841.7559164719987,"d":"3,842"}}]
[]
{"$rows_left_out":47}
{"sheet":"DATOS SUELOS","index":14,"n_rows":42,"n_cols":6,"rows_kept":42,"merged":[[0,2,0,4]]}
[null,"TIPO DE ROCA","Conductividad térmica\n(W/mK)",null,null,"Capacidad térmica volumétrica (MJ/m3K)"]
[null,null,"Mín.","Valor típico","Máx."]
[null,"DEFINIDO POR EL USUARIO"]
[{"$f":"CONCATENATE($B$3,\" - \",B4)","v":"DEFINIDO POR EL USUARIO - Maxey Elementary School"},"Maxey Elementary School",null,2.25,null,2.877]
[{"$f":"CONCATENATE($B$3,\" - \",B5)","v":"DEFINIDO POR EL USUARIO - Providencia"},"Providencia",null,3.55,null,4.55]
[{"$f":"CONCATENATE($B$3,\" - \",B6)","v":"DEFINIDO POR EL USUARIO - "}]
[null,"ROCAS MAGMÁTICAS"]
[{"$f":"CONCATENATE($B$7,\" - \",B8)","v":"ROCAS MAGMÁTICAS - Basalto"},"Basalto",1.3,1.7,2.3,2.45]
{"$rows_left_out":35}
{"sheet":"INGRESO TERRENO","index":15,"n_rows":5,"n_cols":3,"rows_kept":5,"merged":[[0,0,0,3]]}
["INGRESO TIPO SUELO"]
[]
["Tipo Suelo"]
["Conductividad Térmica",null,"W/m°K"]
["Capacidad Térmica",null,"MJ/m3°K"]

{"sheet":"coefficients","index":16,"n_rows":40,"n_cols":8,"rows_kept":40,"merged":[[2,6,2,7]]}
[]
[null,"Coefficients for f6h, f1m, f10y functions",{"$nulls":4},"Coefficients for Tp correlation"]
[null,null,"f6h","f1m","f10y",null,"Tp function's coefficients"]
[null,"a0",0.6619352,0.4132728,0.3057646,null,"b0",{"v":7.8189,"d":"7.8189E+00"}]
[null,"a1",-4.815693,0.2912981,0.08987446,null,"b1",{"v":-64.27,"d":"-6.4270E+01"}]
[null,"a2",15.03571,0.07589286,-0.09151786,null,"b2",{"v":153.87,"d":"1.5387E+02"}]
[null,"a3",{"v":-0.09879421000000001,"d":"-0.09879421"},0.1563978,{"v":-0.038724510000000004,"d":"-0.03872451"},null,"b3",{"v":-84.809,"d":"-8.4809E+01"}]
[null,"a4",0.02917889,-0.2289355,0.1690853,null,"b4",{"v":3.461,"d":"3.4610E+00"}]
{"$rows_left_out":33}
{"sheet":"Instructions","index":17,"n_rows":12,"n_cols":5,"rows_kept":12,"merged":[[1,2,2,2],[1,4,5,4]]}
["Instructions for using the \"bh_sizing\" worksheet, v. 1"]
["1) Fill in the coloured cells (D3 to D21 or E3 to E21) of the section \"1st set of inputs\" with your input parameters",null,"Single  borehole design",null,"Multiple boreholes design"]
["2) The results of the calculations with Tp = 0 (without taking into account the thermal interference among boreholes) are given in section \"1st set of results\".  For single borehole designs, calculations stop here and the value in cell D35 is the required borehole depth. For multiple boreholes, the length given in cell D35 should be regarded as a first approximation of the total borehole length."]
["3) To size a borefield by taking into account the thermal interference, determine the three parameters B (borehole spacing) , NB (number of boreholes) and A (borefield aspect ratio). Use the  1st set of results, which gives a first approximation of the final value of the borehole length, to estimate these three parameters."]
["4) Fill in the coloured cells (E38, E39, E40) of the section \"2nd set of inputs\" with the values of B, NB, and A."]
["5) The final results are given at the end of the section \"final results\", i.e, cells E69 and E70."]
[]
[]
{"$rows_left_out":4}