{"text_format":"1","workbook":"xlsx","n_sheets":9,"sheets":["1.DADES","2.CLIMA","3.TERRENY","4.CONDUCTES","5.CÀLCUL","PARÀMETRES","TAULES","GRÀFICA","DITA"],"not_rendered":{"charts":4,"images":3,"macros":1,"external_links":0,"defined_names":3,"comments":0,"pivot_tables":1},"unopened":[],"bounds":{"document_bytes":16777216,"sheet_cells":100000,"rows_first":2000,"rows_last":500,"rows_between":2000,"halvings":0,"cell_chars":16384,"cell_head_chars":4096},"cells_cut":0,"cells_raw":0,"read":"whole","date_system":"1900"}

{"sheet":"1.DADES","index":0,"n_rows":25,"n_cols":1,"rows_kept":25,"cut":false,"hidden":false,"merged":[[24,2,28,9],[11,2,12,9],[17,2,18,9],[0,0,0,10],[7,2,7,9],[9,2,9,9],[21,2,21,9],[15,2,15,9]]}
["DIMENSIONAMENT INTERCANVIADOR DE TERRA - AIRE | DITA"]
[]
["1. INFORMACIÓ DEL PROJECTE"]
[]
["Dades Generals"]
[]
[]
["     Ref.Projecte"]
[]
["     Projecte"]
[]
["     Localització"]
[]
[]
[]
{"$rows_left_out":11}
{"sheet":"2.CLIMA","index":1,"n_rows":23,"n_cols":12,"rows_kept":23,"cut":false,"hidden":false,"merged":[[0,0,0,12],[7,8,7,11]]}
["DIMENSIONAMENT INTERCANVIADOR DE TERRA - AIRE | DITA"]
[]
["2. CLIMA"]
[]
["Dades Climàtiques anuals"]
[]
[]
[]
[null,null,null,null,null,null,null,"Capitals","Barcelona"]
[]
[null,null,null,null,null,null,null,"Temp. Mitja"]
[null,null,null,null,null,null,null,"Gener",9.4,null,"Latitud"]
[null,null,null,null,null,null,null,"Febrer",9.9,null,{"$f":"(VLOOKUP($I$9,TAULES!$A$4:$AO$55,15))","v":41.24}]
[null,null,null,null,null,null,null,"Març",12.3,null,"Altitud"]
[null,null,null,null,null,null,null,"Abril",14.6,null,{"$f":"(VLOOKUP($I$9,TAULES!$A$4:$AO$55,14))","v":95}]
{"$rows_left_out":9}
{"sheet":"3.TERRENY","index":2,"n_rows":25,"n_cols":12,"rows_kept":25,"cut":false,"hidden":false,"merged":[[0,0,0,12],[7,8,7,11],[11,8,11,11]]}
["DIMENSIONAMENT INTERCANVIADOR DE TERRA - AIRE | DITA"]
[]
["3. TERRENY"]
[]
["Selecció del tipus de terreny"]
[]
[]
[]
[]
[null,null,null,null,null,null,null,null,"Tipus Terreny:"]
[]
[null,null,null,null,null,null,null,null,"07. Llims argilosos"]
[]
[]
[]
{"$rows_left_out":11}
{"sheet":"4.CONDUCTES","index":3,"n_rows":32,"n_cols":12,"rows_kept":32,"cut":false,"hidden":false,"merged":[[29,4,29,5],[31,4,31,5],[0,0,0,12],[7,8,7,11],[11,8,11,11],[25,4,25,5],[27,4,27,5]]}
["DIMENSIONAMENT INTERCANVIADOR DE TERRA - AIRE | DITA"]
[]
["4. CONDUCTE"]
[]
["Dades conducte intercanviador de calor"]
[]
[]
[]
[]
[null,null,null,null,null,null,null,null,"Tipus Conducte:"]
[]
[null,null,null,null,null,null,null,null,"01. Polipropilè"]
[]
[]
[]
{"$rows_left_out":18}
{"sheet":"5.CÀLCUL","index":4,"n_rows":30,"n_cols":14,"rows_kept":30,"cut":false,"hidden":false,"merged":[[31,4,31,7],[0,0,0,14],[25,4,25,5],[29,4,29,7],[23,4,23,7],[27,4,27,5]]}
["DIMENSIONAMENT INTERCANVIADOR DE TERRA - AIRE | DITA"]
[]
["5. CÀLCUL"]
[]
[]
[]
[]
[null,null,null,null,null,null,null,null,null,"Te","Temperatura entrada",null,31,"  ºC"]
[]
[null,null,null,null,null,null,null,null,null,"Ta","Temperatura ambient anual",null,{"$f":"'2.CLIMA'!K21+('2.CLIMA'!K19-'2.CLIMA'!K21)*COS((2*PI()*((365*3600)/PARÀMETRES!D38)))","v":30.50308496671558},"  ºC"]
[]
[null,null,null,null,null,null,null,null,null,"Tg","Temperatura terreny anual",null,{"$f":"GRÀFICA!F20","v":16.416666666666668},"  ºC"]
[]
[null,null,null,null,null,null,null,null,null,"Tg (z)","Temp. terreny a profunditat z",null,{"$f":"('2.CLIMA'!K21+(M8-'2.CLIMA'!K21)*EXP(-('4.CONDUCTES'!E26/PARÀMETRES!D41))*COS((2*PI()*(1/PARÀMETRES!D38))-('4.CONDUCTES'!E26/PARÀMETRES!D41)))","v":20.952838114295069},"  ºC"]
[]
{"$rows_left_out":16}
{"sheet":"PARÀMETRES","index":5,"n_rows":51,"n_cols":5,"rows_kept":51,"cut":false,"hidden":true,"merged":[[2,0,2,4],[18,0,18,4],[28,0,28,4],[44,0,44,4]]}
[]
[]
["TERRENY"]
[null,"Terreny","Calor Específica\n(J/KgK)","Conductivitat\n(W/mk)","Densitat\n(kg/m3)"]
[null,"01. Calcària",2230,0.71,1670]
[null,"02. Sorra",1390,0.93,1780]
[null,"03. Sorra seca",920,0.7,1500]
[null,"04. Terreny sorrenc",1650,1.24,1520]
[null,"05. Gres",710,1.87,2250]
[null,"06. Argila",880,1.28,1500]
[null,"07. Llims argilosos",1340,1.49,1800]
[null,"08. Terreny argilenc",2850,2.2999999999999998,1650]
[null,"09. Terreny argilenc humit",1340,1.4,1800]
[null,"10. Grava seca",909,0.5,1650]
[null,"11. Terreny sec",840,0.87,2022]
{"$rows_left_out":37}
{"sheet":"TAULES","index":6,"n_rows":292,"n_cols":69,"rows_kept":292,"cut":false,"hidden":true,"merged":[[1,1,1,12],[1,20,1,31],[55,0,55,12],[1,55,1,66]]}
["1","2","3","4","5","6","7","8","9","10","11","12","13","14","15","16","17","18","19","20","21","22","23","24","25","26","27","28","29","30","31","32","33","34","35","36","37","38","39","40","41","42","43","44","45","46","47","48","49","50","51","52","53","54","55","56","57","58","59","60","61","62","63","64","65","66","67","68","69"]
[null,"RADIACIÓ HORIZONTAL                                                                                                                                                                                                                                                                                                                                                                                            [kJ/m2/día]",null,null,null,null,null,null,null,null,null,null,null,"ALTITUD             [m]","LATITUD                     [ º , ' ]","LATITUD             [ º ]","VARIACIÓ DIURNA [ºC]","HUMITAT RELATIVA [%]","TEMPERATURA MÀXIMA ESTIU [ºC]","TEMPERATURA MÍNIMA HIVERN [ºC]","TEMPERATURA AMBIENT  (durant las hores de sol )                                                                                                                                                                                                                                                                                                                                                                                                   [ºC]",null,null,null,null,null,null,null,null,null,null,null,"GRAUS DIA NOV./MAR.","GRAUS DIA ANUAL","DIRECCIÓ DEL VENT","VELOCITAT DEL VENT [m/s]","TEMPERATURA AIGUA XARXA [ºC]","TEMPERATURA AMB. MÍNIMA HISTÒRICA [ºC]",null,"TEMPERATURA AMB. MITJA ANUAL [ºC]","ZONA CLIMÁTICA",null,null,null,null,null,null,null,null,null,null,null,null,null,null,"RADIACIÓN HORIZONTAL                                                                                                                                                                                                                                                                                                                                                                                            [Wh/m2/día]",null,null,null,null,null,null,null,null,null,null,null,null,"FUENTE (Datos de Radiación Horizontal)"]
[null,"Gener","Febrer","Març","Abril","Maig","Juny","Juliol","Agost","Setembre","Octubre","Novembre","Desembre",null,null,null,null,null,null,null,"Gener","Febrer","Març","Abril","Maig","Juny","Juliol","Agost","Setembre","Octubre","Novembre","Desembre",null,null,null,null,null,null,null,null,null,"Provincia","ENE","FEB","MAR","ABR","MAY","JUN","JUL","AGO","SEP","OCT","NOV","DIC","AÑO","Enero","Febrero","Marzo","Abril","Mayo","Junio","Julio","Agosto","Septiembre","Octubre","Noviembre","Diciembre"]
["Albacete",6700,10500,15000,19200,21200,25100,26700,23200,18800,12400,8400,6400,686,39,39,18,36,35,-7,4.2,5.6,9,11,15.3,21.6,24.1,23.8,17.8,13.7,8.6999999999999993,5.2,1247.5999999999999,1377.4,"O",12,10,-23,"Albacete",{"$f":"(SUM(U4:AF4))/12","v":13.33333333333333},"D","ÁLAVA",7,7,11,12,15,19,21,21,19,15,10,7,"13.7",{"$f":"B4/3.6","v":1861.1111111111111},{"$f":"C4/3.6","v":2916.6666666666665},{"$f":"D4/3.6","v":4166.666666666667},{"$f":"E4/3.6","v":5333.333333333333},{"$f":"F4/3.6","v":5888.8888888888887},{"$f":"G4/3.6","v":6972.2222222222217},{"$f":"H4/3.6","v":7416.6666666666661},{"$f":"I4/3.6","v":6444.4444444444443},{"$f":"J4/3.6","v":5222.2222222222217},{"$f":"K4/3.6","v":3444.4444444444443},{"$f":"L4/3.6","v":2333.3333333333335},{"$f":"M4/3.6","v":1777.7777777777778},{"$f":"AJ4*1000/3600","v":3.3333333333333335},"Centro de Estudios de la Energía (Ministerio de Industria y Energía) "]
["Alicante",8500,12000,16300,18900,23100,24800,25800,22500,18300,13600,9800,7600,7,38.21,38.35,13,60,31,2,11,11.8,14,15.9,19,22.8,25.5,26.1,23.7,19.3,15.2,12,338.2,338.2,"SE",9,10,-5,"Alicante",{"$f":"(SUM(U5:AF5))/12","v":18.024999999999999},"A","ALBACETE",6,8,11,13,17,22,26,26,22,16,11,7,"15.4",2361.1111111111109,3333.333333333333,4527.7777777777774,5250,6416.6666666666661,6888.8888888888887,7166.6666666666661,6250,5083.333333333333,3777.7777777777778,2722.2222222222222,2111.1111111111109,2.5,"Centro de Estudios de la Energía (Ministerio de Industria y Energía) "]
["Almería",8900,12200,16400,19600,23100,24600,25300,22500,18500,13900,10000,8000,65,36.51,36.85,8,70,30,5,11.7,11.8,14.1,16.100000000000001,18.399999999999999,22,24.7,25.3,23.4,19.399999999999999,15.6,12.8,207.9,207.9,"OSO",9,12,-1,"Almería",17.941666666666666,"A","ALICANTE",13,14,16,18,21,25,28,28,26,21,17,14,"20.1",2472.2222222222222,3388.8888888888887,4555.5555555555557,5444.4444444444443,6416.6666666666661,6833.333333333333,7027.7777777777774,6250,5138.8888888888887,3861.1111111111109,2777.7777777777778,2222.2222222222222,2.5,"Centro de Estudios de la Energía (Ministerio de Industria y Energía) "]
["Ávila",6000,9100,13500,17700,19400,22300,26300,25300,18800,11200,6900,5200,1126,40.39,40.65,17,41,30,-6,2.4,3.3,6.3,8.6999999999999993,12.2,16.399999999999999,20,19.8,16.3,10.6,6,3.2,1672.6,2127.1999999999998,"NO",11,10,-21,"Avila",10.433333333333332,"E","ALMERÍA",15,15,16,18,21,24,27,28,26,22,18,16,"20.5",1666.6666666666665,2527.7777777777778,3750,4916.666666666667,5388.8888888888887,6194.4444444444443,7305.5555555555557,7027.7777777777774,5222.2222222222217,3111.1111111111109,1916.6666666666665,1444.4444444444443,3.0555555555555554,"Centro de Estudios de la Energía (Ministerio de Industria y Energía) "]
["Badajoz",6500,10000,13600,18700,21800,24600,25900,23800,17900,12300,8200,6200,186,38.53,38.880000000000003,17,47,38,-1,8.6,9.9,12.7,15.2,18,22.8,25.8,25.5,22.6,17.8,12.6,9.1,749.4,767.4,"NO",7,10,-6,"Badajoz",16.716666666666665,"B","ASTURIAS",9,10,11,12,15,18,20,20,19,16,12,10,"14.3",1805.5555555555554,2777.7777777777778,3777.7777777777778,5194.4444444444443,6055.5555555555557,6833.333333333333,7194.4444444444443,6611.1111111111113,4972.2222222222217,3416.6666666666665,2277.7777777777778,1722.2222222222222,1.9444444444444444,"Centro de Estudios de la Energía (Ministerio de Industria y Energía) "]
["Baleares",7200,10700,14400,16200,21000,22700,24200,20600,16400,12100,8500,6500,28,39.340000000000003,39.57,8,63,28,4,10.5,10.5,12.2,14.5,17.399999999999999,21.4,24.1,24.5,22.6,18.399999999999999,14.3,11.6,503.4,527.4,"VARIA",9,11,-4,"Baleares",16.833333333333332,"B","ÁVILA",4,5,8,11,14,18,22,22,18,13,8,5,"12.3",2000,2972.2222222222222,4000,4500,5833.333333333333,6305.5555555555557,6722.2222222222217,5722.2222222222217,4555.5555555555557,3361.1111111111109,2361.1111111111109,1805.5555555555554,2.5,"Centro de Estudios de la Energía (Ministerio de Industria y Energía) "]
["Barcelona",6700,9300,13400,17900,21500,23400,22900,20100,16000,11500,7900,6100,95,41.24,41.4,8,68,31,2,9.4,9.9,12.3,14.6,17.7,21.6,24.4,24.2,21.7,17.5,13.5,10.199999999999999,622.70000000000005,655.7,"S",8,12,-20,"Barcelona",16.416666666666664,"B","BADAJOZ",11,12,15,17,20,25,28,28,25,20,15,11,"18.9",1861.1111111111111,2583.3333333333335,3722.2222222222222,4972.2222222222217,5972.2222222222217,6500,6361.1111111111113,5583.333333333333,4444.4444444444443,3194.4444444444443,2194.4444444444443,1694.4444444444443,2.2222222222222223,"Institut Català d'Energia. Atlas de radiaciò solar a Catalunya. Ediciò 1996"]
["Burgos",5100,7900,12400,16000,18700,21500,23000,20700,16700,10100,6500,4500,929,42.2,42.33,15,42,30,-6,2.5,4.8,7.1,9.1999999999999993,12.2,16.2,19,18.8,16.2,11.3,6.5,3.4,1615.2,2048.4,"SO",8,9,-18,"Burgos",10.6,"E","BALEARES",12,13,14,17,19,23,26,27,25,20,16,14,"18.8",1416.6666666666667,2194.4444444444443,3444.4444444444443,4444.4444444444443,5194.4444444444443,5972.2222222222217,6388.8888888888887,5750,4638.8888888888887,2805.5555555555557,1805.5555555555554,1250,2.2222222222222223,"Centro de Estudios de la Energía (Ministerio de Industria y Energía) "]
["Cáceres",6800,10000,14700,19600,22100,25100,28100,25400,19700,12700,8900,6600,459,39.29,39.479999999999997,14,37,38,-1,7.7,9.1,11.7,14.4,17.399999999999999,22.5,26,25.6,22.3,16.899999999999999,11.7,8.1,946.1,1003.1,"NO",7,11,-6,"Caceres",16.116666666666667,"C","BARCELONA",11,12,14,17,20,24,26,26,24,20,16,12,"18.5",1888.8888888888889,2777.7777777777778,4083.333333333333,5444.4444444444443,6138.8888888888887,6972.2222222222217,7805.5555555555557,7055.5555555555557,5472.2222222222217,3527.7777777777778,2472.2222222222222,1833.3333333333333,1.9444444444444444,"Centro de Estudios de la Energía (Ministerio de Industria y Energía) "]
["Cádiz",8100,11500,15700,18500,22200,23800,25900,23000,18100,14200,10000,7400,28,36.28,36.47,12,55,32,2,11.4,12.5,14.6,16.600000000000001,18.899999999999999,22.2,24.5,24.9,23.4,19.5,15.6,12.5,227.4,227.4,"SE",20,10,-2,"Cádiz",18.05,"A","BURGOS",5,6,9,11,14,18,21,21,18,13,9,5,"12.5",2250,3194.4444444444443,4361.1111111111113,5138.8888888888887,6166.6666666666661,6611.1111111111113,7194.4444444444443,6388.8888888888887,5027.7777777777774,3944.4444444444443,2777.7777777777778,2055.5555555555557,5.5555555555555554,"Centro de Estudios de la Energía (Ministerio de Industria y Energía) "]
["Canarias",9766,11700,14880,17602,17844,15932,15358,14990,16624,12160,9650,7370,6,28.11,28.18,4,66,24,15,18.3,19.600000000000001,19.100000000000001,19.600000000000001,20.3,21.4,23.8,23.6,25.9,23.3,22.1,19.899999999999999,241.1,259.10000000000002,"NE",9,10,3,"Canarias",21.408333333333335,"A","CÁCERES",10,11,14,16,19,25,28,28,25,19,14,10,"18.3",2712.7777777777778,3250,4133.333333333333,4889.4444444444443,4956.666666666667,4425.5555555555557,4266.1111111111113,4163.8888888888887,4617.7777777777774,3377.7777777777778,2680.5555555555557,2047.2222222222222,2.5,"Centro de Estudios de la Energía (Ministerio de Industria y Energía) "]
["Castellón",8000,12200,15500,17400,20600,21400,23900,19500,16600,13100,8600,7300,27,39.590000000000003,39.979999999999997,9,60,29,4,10.4,11.1,13.1,14.9,17.8,21.6,24.3,24.7,22.6,18.600000000000001,14.3,11.1,443.4,452.4,"NO",3,10,-8,"Castellón",17.041666666666668,"B","CÁDIZ",13,15,17,19,21,24,27,27,25,22,18,15,"20.3",2222.2222222222222,3388.8888888888887,4305.5555555555557,4833.333333333333,5722.2222222222217,5944.4444444444443,6638.8888888888887,5416.666666666667,4611.1111111111113,3638.8888888888887,2388.8888888888887,2027.7777777777778,0.83333333333333337,"Centro de Estudios de la Energía (Ministerio de Industria y Energía) "]
{"$rows_left_out":278}
{"sheet":"GRÀFICA","index":7,"n_rows":20,"n_cols":12,"rows_kept":20,"cut":false,"hidden":true,"merged":[[0,0,0,12]]}
[]
[]
[]
[]
[]
[]
[null,null,"MESOS","Tm","Ta","Tg","Ts",null,null,"Prof","ξ","Tg"]
[null,null,"Gen",{"$f":"'2.CLIMA'!I12","v":9.4},{"$f":"D8+('2.CLIMA'!$K$19-D8)*COS((2*PI()*((365*3600)/PARÀMETRES!$D$38)))","v":30.263997847843875},{"$f":"D20+(D8-D20)*EXP(-('4.CONDUCTES'!$E$26/(SQRT(('3.TERRENY'!$K$19*PARÀMETRES!$D$38)/(PI()*'3.TERRENY'!$K$16*'3.TERRENY'!$K$22)))))*COS((2*PI()*(1/PARÀMETRES!$D$38))-('4.CONDUCTES'!$E$26/(SQRT(('3.TERRENY'!$K$19*PARÀMETRES!$D$38)/(PI()*'3.TERRENY'!$K$16*'3.TERRENY'!$K$22)))))","v":14.234120175864884},{"$f":"F8-(F8-D8)*EXP(-((3600*'5.CÀLCUL'!$M$23*PI()*'4.CONDUCTES'!$E$30*'4.CONDUCTES'!$E$28)/(PARÀMETRES!$D$30*PARÀMETRES!$D$31*'5.CÀLCUL'!$H$28)))","v":10.471094684803862},null,null,0,{"$f":"J8/(SQRT(('3.TERRENY'!$K$19*PARÀMETRES!$D$38)/(PI()*'3.TERRENY'!$K$16*'3.TERRENY'!$K$22)))","v":0},{"$f":"$D$20+('5.CÀLCUL'!$M$8-$D$20)*(EXP(-($K8))*COS((2*PI()*(1/PARÀMETRES!$D$38))-($K8)))","v":30.999999999999709}]
[null,null,"Feb",{"$f":"'2.CLIMA'!I13","v":9.9},{"$f":"D9+('2.CLIMA'!$K$19-D9)*COS((2*PI()*((365*3600)/PARÀMETRES!$D$38)))","v":30.281034934699342},{"$f":"$D$20+(D9-$D$20)*EXP(-('4.CONDUCTES'!$E$26/(SQRT(('3.TERRENY'!$K$19*PARÀMETRES!$D$38)/(PI()*'3.TERRENY'!$K$16*'3.TERRENY'!$K$22)))))*COS((2*PI()*(1/PARÀMETRES!$D$38))-('4.CONDUCTES'!$E$26/(SQRT(('3.TERRENY'!$K$19*PARÀMETRES!$D$38)/(PI()*'3.TERRENY'!$K$16*'3.TERRENY'!$K$22)))))","v":14.389646054069285},{"$f":"F9-(F9-D9)*EXP(-((3600*'5.CÀLCUL'!$M$23*PI()*'4.CONDUCTES'!$E$30*'4.CONDUCTES'!$E$28)/(PARÀMETRES!$D$30*PARÀMETRES!$D$31*'5.CÀLCUL'!$H$28)))","v":10.89476964788197},null,null,1,{"$f":"J9/(SQRT(('3.TERRENY'!$K$19*PARÀMETRES!$D$38)/(PI()*'3.TERRENY'!$K$16*'3.TERRENY'!$K$22)))","v":0.40157544603426276},{"$f":"$D$20+('5.CÀLCUL'!$M$8-$D$20)*(EXP(-($K9))*COS((2*PI()*(1/PARÀMETRES!$D$38))-($K9)))","v":25.400326851451926}]
[null,null,"Mar",{"$f":"'2.CLIMA'!I14","v":12.3},{"$f":"D10+('2.CLIMA'!$K$19-D10)*COS((2*PI()*((365*3600)/PARÀMETRES!$D$38)))","v":30.362812951605576},{"$f":"$D$20+(D10-$D$20)*EXP(-('4.CONDUCTES'!$E$26/(SQRT(('3.TERRENY'!$K$19*PARÀMETRES!$D$38)/(PI()*'3.TERRENY'!$K$16*'3.TERRENY'!$K$22)))))*COS((2*PI()*(1/PARÀMETRES!$D$38))-('4.CONDUCTES'!$E$26/(SQRT(('3.TERRENY'!$K$19*PARÀMETRES!$D$38)/(PI()*'3.TERRENY'!$K$16*'3.TERRENY'!$K$22)))))","v":15.136170269450417},{"$f":"F10-(F10-D10)*EXP(-((3600*'5.CÀLCUL'!$M$23*PI()*'4.CONDUCTES'!$E$30*'4.CONDUCTES'!$E$28)/(PARÀMETRES!$D$30*PARÀMETRES!$D$31*'5.CÀLCUL'!$H$28)))","v":12.928409470656897},null,null,2,{"$f":"J10/(SQRT(('3.TERRENY'!$K$19*PARÀMETRES!$D$38)/(PI()*'3.TERRENY'!$K$16*'3.TERRENY'!$K$22)))","v":0.80315089206852552},{"$f":"$D$20+('5.CÀLCUL'!$M$8-$D$20)*(EXP(-($K10))*COS((2*PI()*(1/PARÀMETRES!$D$38))-($K10)))","v":20.952838114295069}]
[null,null,"Abr",{"$f":"'2.CLIMA'!I15","v":14.6},{"$f":"D11+('2.CLIMA'!$K$19-D11)*COS((2*PI()*((365*3600)/PARÀMETRES!$D$38)))","v":30.441183551140718},{"$f":"$D$20+(D11-$D$20)*EXP(-('4.CONDUCTES'!$E$26/(SQRT(('3.TERRENY'!$K$19*PARÀMETRES!$D$38)/(PI()*'3.TERRENY'!$K$16*'3.TERRENY'!$K$22)))))*COS((2*PI()*(1/PARÀMETRES!$D$38))-('4.CONDUCTES'!$E$26/(SQRT(('3.TERRENY'!$K$19*PARÀMETRES!$D$38)/(PI()*'3.TERRENY'!$K$16*'3.TERRENY'!$K$22)))))","v":15.851589309190668},{"$f":"F11-(F11-D11)*EXP(-((3600*'5.CÀLCUL'!$M$23*PI()*'4.CONDUCTES'!$E$30*'4.CONDUCTES'!$E$28)/(PARÀMETRES!$D$30*PARÀMETRES!$D$31*'5.CÀLCUL'!$H$28)))","v":14.877314300816201},null,null,3,{"$f":"J11/(SQRT(('3.TERRENY'!$K$19*PARÀMETRES!$D$38)/(PI()*'3.TERRENY'!$K$16*'3.TERRENY'!$K$22)))","v":1.2047263381027882},{"$f":"$D$20+('5.CÀLCUL'!$M$8-$D$20)*(EXP(-($K11))*COS((2*PI()*(1/PARÀMETRES!$D$38))-($K11)))","v":17.981512960856108}]
[null,null,"Mai",{"$f":"'2.CLIMA'!I16","v":17.7},{"$f":"D12+('2.CLIMA'!$K$19-D12)*COS((2*PI()*((365*3600)/PARÀMETRES!$D$38)))","v":30.546813489644606},{"$f":"$D$20+(D12-$D$20)*EXP(-('4.CONDUCTES'!$E$26/(SQRT(('3.TERRENY'!$K$19*PARÀMETRES!$D$38)/(PI()*'3.TERRENY'!$K$16*'3.TERRENY'!$K$22)))))*COS((2*PI()*(1/PARÀMETRES!$D$38))-('4.CONDUCTES'!$E$26/(SQRT(('3.TERRENY'!$K$19*PARÀMETRES!$D$38)/(PI()*'3.TERRENY'!$K$16*'3.TERRENY'!$K$22)))))","v":16.815849754057965},{"$f":"F12-(F12-D12)*EXP(-((3600*'5.CÀLCUL'!$M$23*PI()*'4.CONDUCTES'!$E$30*'4.CONDUCTES'!$E$28)/(PARÀMETRES!$D$30*PARÀMETRES!$D$31*'5.CÀLCUL'!$H$28)))","v":17.50409907190048},null,null,4,{"$f":"J12/(SQRT(('3.TERRENY'!$K$19*PARÀMETRES!$D$38)/(PI()*'3.TERRENY'!$K$16*'3.TERRENY'!$K$22)))","v":1.606301784137051},{"$f":"$D$20+('5.CÀLCUL'!$M$8-$D$20)*(EXP(-($K12))*COS((2*PI()*(1/PARÀMETRES!$D$38))-($K12)))","v":16.312806210723384}]
[null,null,"Jun",{"$f":"'2.CLIMA'!I17","v":21.6},{"$f":"D13+('2.CLIMA'!$K$19-D13)*COS((2*PI()*((365*3600)/PARÀMETRES!$D$38)))","v":30.679702767117242},{"$f":"$D$20+(D13-$D$20)*EXP(-('4.CONDUCTES'!$E$26/(SQRT(('3.TERRENY'!$K$19*PARÀMETRES!$D$38)/(PI()*'3.TERRENY'!$K$16*'3.TERRENY'!$K$22)))))*COS((2*PI()*(1/PARÀMETRES!$D$38))-('4.CONDUCTES'!$E$26/(SQRT(('3.TERRENY'!$K$19*PARÀMETRES!$D$38)/(PI()*'3.TERRENY'!$K$16*'3.TERRENY'!$K$22)))))","v":18.028951604052306},{"$f":"F13-(F13-D13)*EXP(-((3600*'5.CÀLCUL'!$M$23*PI()*'4.CONDUCTES'!$E$30*'4.CONDUCTES'!$E$28)/(PARÀMETRES!$D$30*PARÀMETRES!$D$31*'5.CÀLCUL'!$H$28)))","v":20.80876378390974},null,null,5,{"$f":"J13/(SQRT(('3.TERRENY'!$K$19*PARÀMETRES!$D$38)/(PI()*'3.TERRENY'!$K$16*'3.TERRENY'!$K$22)))","v":2.0078772301713137},{"$f":"$D$20+('5.CÀLCUL'!$M$8-$D$20)*(EXP(-($K13))*COS((2*PI()*(1/PARÀMETRES!$D$38))-($K13)))","v":15.587787178247689}]
[null,null,"Jul",{"$f":"'2.CLIMA'!I18","v":24.4},{"$f":"D14+('2.CLIMA'!$K$19-D14)*COS((2*PI()*((365*3600)/PARÀMETRES!$D$38)))","v":30.77511045350785},{"$f":"$D$20+(D14-$D$20)*EXP(-('4.CONDUCTES'!$E$26/(SQRT(('3.TERRENY'!$K$19*PARÀMETRES!$D$38)/(PI()*'3.TERRENY'!$K$16*'3.TERRENY'!$K$22)))))*COS((2*PI()*(1/PARÀMETRES!$D$38))-('4.CONDUCTES'!$E$26/(SQRT(('3.TERRENY'!$K$19*PARÀMETRES!$D$38)/(PI()*'3.TERRENY'!$K$16*'3.TERRENY'!$K$22)))))","v":18.899896521996958},{"$f":"F14-(F14-D14)*EXP(-((3600*'5.CÀLCUL'!$M$23*PI()*'4.CONDUCTES'!$E$30*'4.CONDUCTES'!$E$28)/(PARÀMETRES!$D$30*PARÀMETRES!$D$31*'5.CÀLCUL'!$H$28)))","v":23.18134357714715},null,null,6,{"$f":"J14/(SQRT(('3.TERRENY'!$K$19*PARÀMETRES!$D$38)/(PI()*'3.TERRENY'!$K$16*'3.TERRENY'!$K$22)))","v":2.4094526762055763},{"$f":"$D$20+('5.CÀLCUL'!$M$8-$D$20)*(EXP(-($K14))*COS((2*PI()*(1/PARÀMETRES!$D$38))-($K14)))","v":15.441970766738375}]
[null,null,"Ago",{"$f":"'2.CLIMA'!I19","v":24.2},{"$f":"D15+('2.CLIMA'!$K$19-D15)*COS((2*PI()*((365*3600)/PARÀMETRES!$D$38)))","v":30.768295618765663},{"$f":"$D$20+(D15-$D$20)*EXP(-('4.CONDUCTES'!$E$26/(SQRT(('3.TERRENY'!$K$19*PARÀMETRES!$D$38)/(PI()*'3.TERRENY'!$K$16*'3.TERRENY'!$K$22)))))*COS((2*PI()*(1/PARÀMETRES!$D$38))-('4.CONDUCTES'!$E$26/(SQRT(('3.TERRENY'!$K$19*PARÀMETRES!$D$38)/(PI()*'3.TERRENY'!$K$16*'3.TERRENY'!$K$22)))))","v":18.837686170715198},{"$f":"F15-(F15-D15)*EXP(-((3600*'5.CÀLCUL'!$M$23*PI()*'4.CONDUCTES'!$E$30*'4.CONDUCTES'!$E$28)/(PARÀMETRES!$D$30*PARÀMETRES!$D$31*'5.CÀLCUL'!$H$28)))","v":23.011873591915908},null,null,7,{"$f":"J15/(SQRT(('3.TERRENY'!$K$19*PARÀMETRES!$D$38)/(PI()*'3.TERRENY'!$K$16*'3.TERRENY'!$K$22)))","v":2.811028122239839},{"$f":"$D$20+('5.CÀLCUL'!$M$8-$D$20)*(EXP(-($K15))*COS((2*PI()*(1/PARÀMETRES!$D$38))-($K15)))","v":15.587065620399683}]
{"$rows_left_out":6}
{"sheet":"DITA","index":8,"n_rows":38,"n_cols":21,"rows_kept":38,"cut":false,"hidden":true,"merged":[]}
[]
["GAEA"]
[]
[null,"Qw= L · ΔTm · ht"]
[]
[]
[null,null,null,null,null,null,null,null,"Temperatura del terreny a la paret del conducte"]
[null,null,null,"Tg1= Tam + (Tamax-Tam) · e-z cos (2π t/t0 -z)",null,null,null,null,"Temperatura del terreny a la paret del conducte sense influència d'aquesta"]
[null,null,null,null,null,null,null,null,"t/t0 = fracció de temps en que t/t0=0 per una temperatura ambient màxima"]
[null,null,null,"to=",{"$f":"365*24*60*60","v":31536000},"s"]
[null,null,null,"t:",{"$f":"24*365*60*60","v":31536000},"s"]
[null,null,null,"x:",2,"m",null,"Te=",31]
[null,null,null,"L:",30,"m",null,"Ta=",{"$f":"E15+(E14-E15)*COS(2*PI()*(E11/E10))","v":31},{"$f":"E15+(E14-E15)*COS(2*PI()*(K14))","v":26.839937968506369},{"$f":"COS(2*PI())","v":1},null,{"$f":"31*24*60*60","v":2678400},null,null,null,"Profunditat","pp","Tg",null,"cos"]
[null,null,null,"Tmax:",31,"ºC",null,"z=",{"$f":"E12*SQRT((PI()*E30*E31)/(E32*E10))","v":0.80046924554346999},{"$f":"E14-E15","v":14.579999999999998},{"$f":"(45/(365))","v":0.12328767123287671},null,null,null,null,null,0,{"$f":"Q14*SQRT((PI()*$E$30*$E$31)/($E$32*$E$10))","v":0},{"$f":"$E$15+($E$14-$E$15)*(EXP(-$R14))*COS((2*PI()*$E$11/$E$10)-R14)","v":31},{"$f":"$E$15+($E$14-$E$15)*(EXP(-$R14))","v":31},{"$f":"COS((2*PI()*$E$11/$E$10)-R14)","v":1}]
[null,null,null,"Tm:",{"$f":"16.42","v":16.420000000000002},"ºC",null,"Tg=",{"$f":"E15+(E14-E15)*(EXP(-I14))*COS((2*PI()*E11/E10)-I14)","v":20.979930371647086},null,null,null,null,null,null,null,1,{"$f":"Q15*SQRT((PI()*$E$30*$E$31)/($E$32*$E$10))","v":0.40023462277173499},{"$f":"$E$15+($E$14-$E$15)*(EXP(-$R15))*COS((2*PI()*$E$11/$E$10)-R15)","v":25.418769586425313},{"$f":"$E$15+($E$14-$E$15)*(EXP(-$R15))","v":26.190973509355757},{"$f":"COS((2*PI()*$E$11/$E$10)-R15)","v":0.92096960224167512}]
{"$rows_left_out":23}