{"text_format":"3","workbook":"xlsx","n_sheets":18,"sheets":["PERFORACIONES","TUBERIA Y FLUIDO","TERRENO","METODO","C.T. DIRECTO","C.T. GRADOS DIA","BOMBA DE CALOR","RESULTADOS","SENSIBILIDAD","DIM CALEFACCION","DIM REFRIGERACIÓN","DATOS TUBERIAS","DATOS FLUIDOS","PROPIEDAD FLUIDOS","DATOS SUELOS","INGRESO TERRENO","coefficients","Instructions"],"not_rendered":{"charts":1,"images":9,"macros":1,"defined_names":2},"read":"whole","date_system":"1900"}

{"sheet":"PERFORACIONES","index":0,"n_rows":167,"n_cols":12,"rows_kept":167,"merged":[[0,0,0,3]]}
["CONFIGURACIÓN DE PERFORACIONES",{"$nulls":5},1,1,"1; Lineal 1X1",1,1,"1; Lineal 1X1"]
[{"$nulls":6},4,4,"4; Matricial 2X2",2,2]
["Tipo de perforación","Vertical",{"$nulls":4},5,4,"4; Lineal 4X1",4,1]
["Número de perforaciones",1,1,{"$nulls":3},6,5,"5; Lineal 5X1",5,1]
["Radio de perforacion",0.054,"m",{"$nulls":3},7,6,"6; Matricial 3X2",3,2]
["Distancia entre perforaciones",4.88,"m",{"$nulls":3},8,6,"6; Lineal 6X1",6,1]
["Geometría de perforación",1,{"$nulls":4},9,7,"7; Lineal 7X1",7,1]
["Conductividad Térmica Mortero",0.7,"W/m°K",{"$nulls":3},10,8,"8; Matricial 4X2",4,2]
["Ratio de diseño ",{"v":1,"d":"1.00"},{"$nulls":4},12,8,"8; Lineal 8X1",8,1]
[{"$nulls":6},14,9,"9; Matricial 3X3",3,3]
{"$rows_left_out":158}
{"sheet":"TUBERIA Y FLUIDO","index":1,"n_rows":13,"n_cols":11,"rows_kept":13,"merged":[[0,0,0,2],[0,3,0,6]]}
["SELECCIÓN TUBERIA",null,null,"SELECCIÓN FLUIDO",{"$nulls":3},{"$f":"B9","v":0.025},{"$f":"IF(B3=\"Polietileno\",\"PE32\",\"PB4\")","v":"PE32"},{"$f":"IF(B4=\"PE32\",\"PN4\",IF(OR(B4=\"PE50A\",B4=\"PE50B\",B4=\"PE80\",B4=\"PE100\"),\"PN6\",\"PN8\"))","v":"PN6"},{"$f":"IF(OR(AND(B4=\"PE50A\",B5=\"PN6\"),AND(B4=\"PE50A\",B5=\"PN16\"),AND(B4=\"PE50B\",B5=\"PN6\"),AND(B4=\"PE80\",B5=\"PN6\"),AND(B4=\"PE100\",B5=\"PN25\")),\"\",\"3/4''\")","v":""}]
[{"$nulls":7},{"$f":"B9+0.006","v":0.031},{"$f":"IF(B3=\"Polietileno\",\"PE50A\",\"PB5\")","v":"PE50A"},{"$f":"IF(B4=\"PE32\",\"PN6\",IF(OR(B4=\"PE50A\",B4=\"PE50B\",B4=\"PE80\",B4=\"PE100\"),\"PN10\",\"PN10\"))","v":"PN10"},{"$f":"IF(OR(AND(B4=\"PE50A\",B5=\"PN16\"),AND(B4=\"PE80\",B5=\"PN6\"),AND(B4=\"PB4\",B5=\"PN8\")),\"\",\"1''\")","v":"1''"}]
["Material","Polietileno",null,"Fluido","Agua Pura",null,null,{"$f":"(2*PERFORACIONES!B5-2*B9)/3+B9","v":{"v":0.044333333333333336,"d":"0.044"}},{"$f":"IF(B3=\"Polietileno\",\"PE50B\",\"\")","v":"PE50B"},{"$f":"IF(B4=\"PE32\",\"PN10\",IF(OR(B4=\"PE50A\",B4=\"PE50B\",B4=\"PE100\"),\"PN16\",\"\"))","v":"PN16"},{"$f":"IF(OR(AND(B4=\"PE80\",B5=\"PN6\"),AND(B4=\"PB4\",B5=\"PN8\")),\"\",\"1 1/4''\")","v":"1 1/4''"}]
["Tipo","PE50A",null,"% en peso Anticongelante",0,"%",null,{"$f":"2*PERFORACIONES!B5-B9","v":{"v":0.08299999999999999,"d":"0.083"}},{"$f":"IF(B3=\"Polietileno\",\"PE80\",\"\")","v":"PE80"},{"$f":"IF(B4=\"PE100\",\"PN25\",\"\")","v":""},{"$f":"IF(OR(AND(B4=\"PB4\",B5=\"PN8\")),\"\",\"1 1/2''\")","v":"1 1/2''"}]
["Presión Nominal","PN6",null,"Temperatura media fluido",32,"°C",null,null,{"$f":"IF(B3=\"Polietileno\",\"PE100\",\"\")","v":"PE100"},null,{"$f":"IF(OR(AND(B4=\"PB4\",B5=\"PN8\"),AND(B4=\"PB4\",B5=\"PN10\")),\"\",\"2''\")","v":"2''"}]
["Diámetro Nominal","1''",null,"Flujo total del sistema",{"v":1044.6,"d":"1,044.6"},"l/h",{"$nulls":4},{"$f":"IF(OR(AND(B4=\"PB4\",B5=\"PN8\"),AND(B4=\"PB4\",B5=\"PN10\")),\"\",\"2 1/2''\")","v":"2 1/2''"}]
["Distancia centro-centro U-tube",0.065,"m","Flujo por perforación",{"$f":"E6/PERFORACIONES!C4","v":{"v":1044.6,"d":"1045"}},"l/h"]
["Diametro Interno",{"$f":"VLOOKUP(CONCATENATE(B3,B4,B5,B6),'DATOS TUBERIAS'!$A$2:$H$108,7,FALSE)/1000","v":0.021},"m","Densidad ",{"$f":"VLOOKUP(E3,'DATOS FLUIDOS'!$A$2:$G$4,4,FALSE)","v":998.1},"kg/m3"]
["Diametro Externo",{"$f":"VLOOKUP(CONCATENATE(B3,B4,B5,B6),'DATOS TUBERIAS'!$A$2:$H$108,6,FALSE)/1000","v":0.025},"m","Capacidad Térmica",{"$f":"VLOOKUP(E3,'DATOS FLUIDOS'!$A$2:$G$4,5,FALSE)","v":{"v":4173,"d":"4,173.0"}},"J/kg°K"]
["Conductividad Térmica",{"$f":"VLOOKUP(CONCATENATE(B3,B4,B5,B6),'DATOS TUBERIAS'!$A$2:$H$108,8,FALSE)","v":{"v":0.43,"d":"0.430"}},"W/m°K","Conductividad Térmica",{"$f":"VLOOKUP(E3,'DATOS FLUIDOS'!$A$2:$G$4,6,FALSE)","v":{"v":0.5929,"d":"0.593"}},"W/m°K"]
{"$rows_left_out":4}
{"sheet":"TERRENO","index":2,"n_rows":7,"n_cols":3,"rows_kept":7,"merged":[[0,0,0,3]]}
["SELECCIÓN DEL TERRENO"]
[]
["Tipo Suelo","DEFINIDO POR EL USUARIO - Fort Polk"]
["Temperatura imperturbable",19.9,"°C"]
["Conductividad Térmica",{"$f":"VLOOKUP($B$3,'DATOS SUELOS'!$A$4:$F$42,4,FALSE)","v":2.423},"W/m°K"]
["Capacidad Térmica",{"$f":"VLOOKUP($B$3,'DATOS SUELOS'!$A$4:$F$42,6,FALSE)","v":2.676},"MJ/m3°K"]
["Difusividad Térmica",{"$f":"B5*3600*24/(B6*1000000)","v":{"v":0.07823139013452914,"d":"0.078"}},"m2/día"]

{"sheet":"METODO","index":3,"n_rows":3,"n_cols":4,"rows_kept":3,"merged":[[0,0,0,4]]}
["SELECCIÓN MÉTODO INGRESO DE CARGAS TÉRMICAS"]
[]
[1,"MÉTODO DIRECTO",null,"MÉTODO GRADOS DÍA"]

{"sheet":"C.T. DIRECTO","index":4,"n_rows":14,"n_cols":8,"rows_kept":14,"merged":[[0,0,0,7]]}
["INGRESO CARGAS TÉRMICAS - METODO DIRECTO"]
["Mes","Total Calefacción\nkWh","Total Refrigeración\nkWh","Pot. Max. Calefacción\nkW","Pot. Max. Refrigeración\nkW","Calor Absorbido\nkWh","Calor Inyectado\nkWh"]
["Enero",{"v":868.08,"d":"868.1"},{"v":0,"d":"0.0"},{"v":4.63,"d":"4.6"},{"v":0,"d":"0.0"},{"v":645.05,"d":"645.1"},{"v":0,"d":"0.0"},31]
["Febrero",{"v":550.39,"d":"550.4"},{"v":0,"d":"0.0"},{"v":4.48,"d":"4.5"},{"v":0,"d":"0.0"},{"v":408.25,"d":"408.3"},{"v":0,"d":"0.0"},28]
["Marzo",{"v":344.07,"d":"344.1"},{"v":0,"d":"0.0"},{"v":3.66,"d":"3.7"},{"v":0,"d":"0.0"},{"v":254.09,"d":"254.1"},{"v":0,"d":"0.0"},31]
["Abril",{"v":0,"d":"0.0"},{"v":83.82,"d":"83.8"},{"v":0,"d":"0.0"},{"v":3.17,"d":"3.2"},{"v":0,"d":"0.0"},{"v":97.01,"d":"97.0"},30]
["Mayo",{"v":0,"d":"0.0"},532.8,{"v":0,"d":"0.0"},{"v":4.48,"d":"4.5"},{"v":0,"d":"0.0"},{"v":625.12,"d":"625.1"},31]
["Junio",{"v":0,"d":"0.0"},{"v":837.01,"d":"837.0"},{"v":0,"d":"0.0"},{"v":4.81,"d":"4.8"},{"v":0,"d":"0.0"},{"v":987.36,"d":"987.4"},30]
["Julio",{"v":0,"d":"0.0"},{"v":1821.14,"d":"1,821.1"},{"v":0,"d":"0.0"},{"v":5.25,"d":"5.3"},{"v":0,"d":"0.0"},{"v":2263.68,"d":"2,263.7"},31]
["Agosto",{"v":0,"d":"0.0"},{"v":1825.54,"d":"1,825.5"},{"v":0,"d":"0.0"},{"v":5.66,"d":"5.7"},{"v":0,"d":"0.0"},{"v":2271.59,"d":"2,271.6"},31]
{"$rows_left_out":5}
{"sheet":"C.T. GRADOS DIA","index":5,"n_rows":24,"n_cols":6,"rows_kept":24,"merged":[[0,0,0,5],[7,1,7,2],[7,3,7,4]]}
["INGRESO CARGAS TÉRMICAS - MÉTODO GRADOS DIAS"]
[]
["Coef. Volumétrico de pérdidas",0.89,"W/°C m3"]
["Volumen a climatizar",224,"m3"]
["Coef. Uso de la instalación",1]
["Coef. Intermitencia instalación",0.85]
[]
[null,"CALEFACCIÓN",null,"REFRIGERACIÓN"]
["Temperatura Interior de Proyecto",21.1,"°C",23.3,"°C"]
["Temperatura Exterior de Proyecto",-5,"°C",35,"°C"]
{"$rows_left_out":15}
{"sheet":"BOMBA DE CALOR","index":6,"n_rows":10,"n_cols":4,"rows_kept":10,"merged":[[0,0,0,4]]}
["CONFIGURACION BOMBA DE CALOR"]
[]
[null,"CALEFACCION","REFRIGERACION"]
["Temperatura Entrada Fluido",0,29.44,"°C"]
["COP Bomba de Calor",4.08,3.89]
["Potencia Nominal Bomba de Calor",3.63,5.33,"kW"]
["Potencia Máxima Demandada",{"$f":"IF(METODO!A3=1,MAX('C.T. DIRECTO'!$D$3:$D$14),'C.T. GRADOS DIA'!B3*'C.T. GRADOS DIA'!B4*('C.T. GRADOS DIA'!B9-'C.T. GRADOS DIA'!B10)/1000)","v":{"v":4.63,"d":"4.6"}},{"$f":"IF(METODO!A3=1,MAX('C.T. DIRECTO'!$E$3:$E$14),'C.T. GRADOS DIA'!B3*'C.T. GRADOS DIA'!B4*('C.T. GRADOS DIA'!D10-'C.T. GRADOS DIA'!D9)/1000)","v":{"v":5.66,"d":"5.7"}},"kW"]
["Carga máxima al terreno por hora",{"$f":"B7-B7/B5","v":{"v":3.4951960784313725,"d":"3.5"}},{"$f":"C7+C7/C5","v":{"v":7.1150128534704375,"d":"7.1"}},"kW"]
["Carga máxima al terreno por mes",{"$f":"IF(METODO!A3=1,VLOOKUP($B$7,'C.T. DIRECTO'!$D$3:$F$14,3,FALSE)/(VLOOKUP($B$7,'C.T. DIRECTO'!$D$3:$H$14,5,FALSE)*24),MAX('C.T. GRADOS DIA'!C13:C24)/(VLOOKUP(MAX('C.T. GRADOS DIA'!C13:C24),'C.T. GRADOS DIA'!C13:F24,4,FALSE)*24)-(MAX('C.T. GRADOS DIA'!C13:C24)/(VLOOKUP(MAX('C.T. GRADOS DIA'!C13:C24),'C.T. GRADOS DIA'!C13:F24,4,FALSE)*24))/B5)","v":{"v":0.867002688172043,"d":"0.9"}},{"$f":"IF(METODO!A3=1,VLOOKUP($C$7,'C.T. DIRECTO'!$E$3:$G$14,3,FALSE)/(VLOOKUP($C$7,'C.T. DIRECTO'!$E$3:$H$14,4,FALSE)*24),MAX('C.T. GRADOS DIA'!E13:E24)/(VLOOKUP(MAX('C.T. GRADOS DIA'!E13:E24),'C.T. GRADOS DIA'!E13:F24,2,FALSE)*24)+(MAX('C.T. GRADOS DIA'!E13:E24)/(VLOOKUP(MAX('C.T. GRADOS DIA'!E13:E24),'C.T. GRADOS DIA'!E13:F24,2,FALSE)*24))/C5)","v":{"v":3.053212365591398,"d":"3.1"}},"kW"]
["Carga promedio al terreno  por año",{"$f":"IF(METODO!A3=1,ABS((SUM('C.T. DIRECTO'!$F$3:$F$14)-SUM('C.T. DIRECTO'!$G$3:$G$14))/8760),ABS(((SUM('C.T. GRADOS DIA'!C13:C24)-SUM('C.T. GRADOS DIA'!C13:C24)/B5)-(SUM('C.T. GRADOS DIA'!E13:E24)+SUM('C.T. GRADOS DIA'!E13:E24)/C5))/8760))","v":{"v":0.7124372146118723,"d":"0.71"}},{"$f":"IF(METODO!A3=1,ABS((SUM('C.T. DIRECTO'!$F$3:$F$14)-SUM('C.T. DIRECTO'!$G$3:$G$14))/8760),ABS(((SUM('C.T. GRADOS DIA'!C13:C24)-SUM('C.T. GRADOS DIA'!C13:C24)/B5)-(SUM('C.T. GRADOS DIA'!E13:E24)+SUM('C.T. GRADOS DIA'!E13:E24)/C5))/8760))","v":{"v":0.7124372146118723,"d":"0.71"}},"kW"]
{"$rows_left_out":1}
{"sheet":"RESULTADOS","index":7,"n_rows":20,"n_cols":7,"rows_kept":20,"merged":[[0,0,0,7],[2,0,3,0],[5,0,7,0],[9,0,12,0],[14,0,15,0],[17,0,19,0]]}
["RESULTADOS"]
[{"$nulls":3},"CALEFACCIÓN",null,"REFRIGERACIÓN"]
["GENERAL","Longitud Total","L",{"$f":"IF(PERFORACIONES!B4=1,'DIM CALEFACCION'!D35,'DIM CALEFACCION'!E69)","v":{"v":55.23783546342679,"d":"55.2"}},null,{"$f":"IF(PERFORACIONES!B4=1,'DIM REFRIGERACIÓN'!D35,'DIM REFRIGERACIÓN'!E69)","v":{"v":198.38187917132535,"d":"198.4"}},"m"]
[null,"Longitud por Perforación","H",{"$f":"IF(PERFORACIONES!B4=1,'DIM CALEFACCION'!D35,'DIM CALEFACCION'!E70)","v":{"v":55.23783546342679,"d":"55.2"}},null,{"$f":"IF(PERFORACIONES!B4=1,'DIM REFRIGERACIÓN'!D35,'DIM REFRIGERACIÓN'!E70)","v":{"v":198.38187917132535,"d":"198.4"}},"m"]
[]
["TERRENO","Resistencia Térmica Terreno 6h","R6h",{"$f":"'DIM CALEFACCION'!D29","v":{"v":0.09743189273030176,"d":"0.097"}},null,{"$f":"'DIM REFRIGERACIÓN'!D29","v":{"v":0.09743189273030176,"d":"0.097"}},"m°K/W"]
[null,"Resistencia Térmica Terreno 1m","R1m",{"$f":"'DIM CALEFACCION'!D30","v":{"v":0.14942257386901625,"d":"0.149"}},null,{"$f":"'DIM REFRIGERACIÓN'!D30","v":{"v":0.14942257386901625,"d":"0.149"}},"m°K/W"]
[null,"Resistencia Térmica Terreno 10y","R10y",{"$f":"'DIM CALEFACCION'!D31","v":{"v":0.15754126744095104,"d":"0.158"}},null,{"$f":"'DIM REFRIGERACIÓN'!D31","v":{"v":0.15754126744095104,"d":"0.158"}},"m°K/W"]
[]
["PERFORACIÓN","Resistencia Térmica Convectiva","Rconv",{"$f":"'DIM CALEFACCION'!D24","v":{"v":0.004055810549358974,"d":"0.004"}},null,{"$f":"'DIM REFRIGERACIÓN'!D24","v":{"v":0.004055810549358974,"d":"0.004"}},"m°K/W"]
{"$rows_left_out":11}
{"sheet":"SENSIBILIDAD","index":8,"n_rows":23,"n_cols":19,"rows_kept":23,"merged":[[0,1,0,3],[0,4,0,6],[0,7,0,9],[0,10,0,12],[0,13,0,15],[0,16,0,18]]}
[null,"Variación Distancia U-Tube",null,null,"Variación T° Imperturbable",null,null,"Variacion Distancia Entre Perforaciones",null,null,"Variacion Conductividad Termica mortero",null,null,"Variación Conductividad Termica Suelo",null,null,"Variación Capacidad Termica Suelo"]
["Delta Variable","Distancia U-Tube","Longitud Total","Delta Longitud","T° Imperturbable","Longitud Total","Delta Longitud","Distancia Entre Perforaciones","Longitud Total","Delta Longitud","Conductividad Termica mortero","Longitud Total","Delta Longitud","Conductividad Termica Suelo","Longitud Total","Delta Longitud","Capacidad Termica Suelo","Longitud Total","Delta Longitud"]
[{"v":-0.5,"d":"-50%"},{"$f":"B$13*(1+$A3)","v":{"v":0.0325,"d":"0.033"}},{"v":248.0265456569003,"d":"248.0"},{"$f":"C3/C$13-1","v":{"v":0.2502479898514376,"d":"25.0%"}},{"$f":"E$13*(1+$A3)","v":{"v":9.95,"d":"9.950"}},{"v":110.39325835992582,"d":"110.4"},{"$f":"F3/F$13-1","v":{"v":-0.4435315421899564,"d":"-44.4%"}},{"$f":"H$13*(1+$A3)","v":{"v":2.44,"d":"2.440"}},{"v":198.38187917132535,"d":"198.4"},{"$f":"I3/I$13-1","v":{"v":0,"d":"0.0%"}},{"$f":"K$13*(1+$A3)","v":{"v":0.35,"d":"0.350"}},{"v":272.58029916063106,"d":"272.6"},{"$f":"L3/L$13-1","v":{"v":0.3740181325998375,"d":"37.4%"}},{"$f":"N$13*(1+$A3)","v":{"v":1.2115,"d":"1.212"}},{"v":279.2749944469874,"d":"279.3"},{"$f":"O3/O$13-1","v":{"v":0.40776463865332,"d":"40.8%"}},{"$f":"Q$13*(1+$A3)","v":1.338},{"v":210.30566745142798,"d":"210.3"},{"$f":"R3/R$13-1","v":{"v":0.06010522901542381,"d":"6.0%"}}]
[{"v":-0.45,"d":"-45%"},{"v":0.035750000000000004,"d":"0.036"},{"v":241.71366834527475,"d":"241.7"},{"$f":"C4/C$13-1","v":{"v":0.218426145346307,"d":"21.8%"}},10.945,{"v":115.51679247128861,"d":"115.5"},{"$f":"F4/F$13-1","v":{"v":-0.41770491864568593,"d":"-41.8%"}},2.684,{"v":198.38187917132535,"d":"198.4"},{"$f":"I4/I$13-1","v":{"v":0,"d":"0.0%"}},0.385,{"v":259.12608154148825,"d":"259.1"},{"$f":"L4/L$13-1","v":{"v":0.306198341420606,"d":"30.6%"}},{"v":1.3326500000000001,"d":"1.333"},{"v":265.3476946094911,"d":"265.3"},{"$f":"O4/O$13-1","v":{"v":0.3375601426798318,"d":"33.8%"}},{"v":1.4718000000000002,"d":"1.472"},{"v":208.64153394082038,"d":"208.6"},{"$f":"R4/R$13-1","v":{"v":0.05171669313926919,"d":"5.2%"}}]
[{"v":-0.4,"d":"-40%"},0.039,{"v":235.89463151354923,"d":"235.9"},{"v":0.18909364352692393,"d":"18.9%"},{"v":11.94,"d":"11.940"},{"v":121.13905690568927,"d":"121.1"},{"v":-0.3893643037776051,"d":"-38.9%"},2.928,{"v":198.38187917132535,"d":"198.4"},{"v":0,"d":"0.0%"},{"v":0.42,"d":"0.420"},{"v":247.9060875048823,"d":"247.9"},{"v":0.2496407864489838,"d":"25.0%"},{"v":1.4538,"d":"1.454"},{"v":253.516697477074,"d":"253.5"},{"v":0.2779226537023245,"d":"27.8%"},{"v":1.6056000000000001,"d":"1.606"},{"v":207.12794950245706,"d":"207.1"},{"v":0.04408704246408757,"d":"4.4%"}]
[{"v":-0.35,"d":"-35%"},{"v":0.04225,"d":"0.042"},{"v":230.4742996350457,"d":"230.5"},{"v":0.16177092684964878,"d":"16.2%"},{"v":12.934999999999999,"d":"12.935"},{"v":127.33659761516921,"d":"127.3"},{"v":-0.3581238460535019,"d":"-35.8%"},3.172,{"v":198.38187917132535,"d":"198.4"},{"v":0,"d":"0.0%"},{"v":0.45499999999999996,"d":"0.455"},{"v":238.40500132874115,"d":"238.4"},{"v":0.20174787296399832,"d":"20.2%"},{"v":1.57495,"d":"1.575"},{"v":243.32991024221855,"d":"243.3"},{"v":0.22657326999143623,"d":"22.7%"},{"v":1.7394,"d":"1.739"},{"v":205.74095172587968,"d":"205.7"},{"v":0.037095487679088546,"d":"3.7%"}]
[{"v":-0.3,"d":"-30%"},{"v":0.0455,"d":"0.046"},{"v":225.3755631111859,"d":"225.4"},{"v":0.13606930256240002,"d":"13.6%"},{"v":13.929999999999998,"d":"13.930"},{"v":134.20246970075686,"d":"134.2"},{"v":-0.3235144749039415,"d":"-32.4%"},3.416,{"v":198.38187917132535,"d":"198.4"},{"v":0,"d":"0.0%"},{"v":0.48999999999999994,"d":"0.490"},{"v":230.25472811152872,"d":"230.3"},{"v":0.1606641144510863,"d":"16.1%"},{"v":1.6961,"d":"1.696"},{"v":234.4581424005937,"d":"234.5"},{"v":0.18185261365586913,"d":"18.2%"},{"v":1.8732,"d":"1.873"},{"v":204.46178655662152,"d":"204.5"},{"v":0.03064749366571662,"d":"3.1%"}]
[{"v":-0.25,"d":"-25%"},{"v":0.04875,"d":"0.049"},{"v":220.53383814469143,"d":"220.5"},{"v":0.1116632177590946,"d":"11.2%"},{"v":14.924999999999999,"d":"14.925"},{"v":141.850941862644,"d":"141.9"},{"v":-0.2849601866098892,"d":"-28.5%"},{"v":3.66,"d":"3.660"},{"v":198.38187917132535,"d":"198.4"},{"v":0,"d":"0.0%"},{"v":0.5249999999999999,"d":"0.525"},{"v":223.18532084371526,"d":"223.2"},{"v":0.1250287666191996,"d":"12.5%"},{"v":1.81725,"d":"1.817"},{"v":226.65569298826827,"d":"226.7"},{"v":0.1425221594585524,"d":"14.3%"},2.007,{"v":203.2755193262821,"d":"203.3"},{"v":0.024667778001692175,"d":"2.5%"}]
[{"v":-0.2,"d":"-20%"},{"v":0.052000000000000005,"d":"0.052"},{"v":215.89321556133532,"d":"215.9"},{"v":0.08827084642588212,"d":"8.8%"},{"v":15.92,"d":"15.920"},{"v":150.42390677148205,"d":"150.4"},{"v":-0.24174573101218644,"d":"-24.2%"},3.904,{"v":198.38187917132535,"d":"198.4"},{"v":0,"d":"0.0%"},{"v":0.5599999999999999,"d":"0.560"},{"v":216.99430978267893,"d":"217.0"},{"v":0.09382122343583421,"d":"9.4%"},{"v":1.9384000000000001,"d":"1.938"},{"v":219.73526246558416,"d":"219.7"},{"v":0.1076377710678793,"d":"10.8%"},{"v":2.1408,"d":"2.141"},{"v":202.17007455601973,"d":"202.2"},{"v":0.019095470818798033,"d":"1.9%"}]
[{"v":-0.15,"d":"-15%"},{"v":0.05525,"d":"0.055"},{"v":211.40360955751794,"d":"211.4"},{"v":0.06563971689645531,"d":"6.6%"},16.915,{"v":160.09976548180146,"d":"160.1"},{"v":-0.19297182711160288,"d":"-19.3%"},4.148,{"v":198.38187917132535,"d":"198.4"},{"v":0,"d":"0.0%"},0.595,{"v":211.5268567153977,"d":"211.5"},{"v":0.06626097907218731,"d":"6.6%"},{"v":2.0595499999999998,"d":"2.060"},{"v":213.55144232614026,"d":"213.6"},{"v":0.0764664757596849,"d":"7.6%"},{"v":2.2746,"d":"2.275"},{"v":201.13555677305473,"d":"201.1"},{"v":0.013880691186271443,"d":"1.4%"}]
{"$rows_left_out":14}
{"sheet":"DIM CALEFACCION","index":9,"n_rows":70,"n_cols":6,"rows_kept":70,"merged":[[1,0,1,2],[2,5,4,5],[5,0,5,2],[9,0,9,2],[13,0,13,2],[22,0,22,2],[27,0,27,2],[31,0,31,2],[36,0,36,2],[41,0,41,2]]}
["PRIMER SET DE INPUTS",null,"UNIDADES","Perforación única","Multiples perforaciones"]
["Calor inyectado/absorbido"]
["Carga máxima al terreno por hora","qh","W",{"$f":"-'BOMBA DE CALOR'!B8*1000","v":{"v":-3495.1960784313724,"d":"-3495"}},{"$f":"D3","v":{"v":-3495.1960784313724,"d":"-3495"}},"Convención de signos:\n+: Calor inyectado al terreno\n-: Calor absorbido del terreno"]
["Carga máxima al terreno por mes","qm","W",{"$f":"-'BOMBA DE CALOR'!B9*1000","v":{"v":-867.002688172043,"d":"-867"}},{"$f":"D4","v":{"v":-867.002688172043,"d":"-867"}}]
["Carga al terreno por año","qy","W",{"$f":"-'BOMBA DE CALOR'!B10*1000","v":{"v":-712.4372146118723,"d":"-712"}},{"$f":"D5","v":{"v":-712.4372146118723,"d":"-712"}}]
["Propiedades del terreno"]
["Conductividad Térmica","k","W.m-1K-1",{"$f":"TERRENO!B5","v":2.423},{"$f":"D7","v":2.423}]
["Difusividad Térmica","α","m2.día-1",{"$f":"TERRENO!B7","v":{"v":0.07823139013452914,"d":"0.078"}},{"$f":"D8","v":{"v":0.07823139013452914,"d":"0.078"}},"<- Aviso: α debe estar entre el rango 0,025 y 0,2 m²/day"]
["Temperatura imperturbable del terreno","Tg","°C",{"$f":"TERRENO!B4","v":19.9},{"$f":"D9","v":19.9}]
["Propiedades del fluido"]
{"$rows_left_out":61}
{"sheet":"DIM REFRIGERACIÓN","index":10,"n_rows":70,"n_cols":6,"rows_kept":70,"merged":[[1,0,1,2],[2,5,4,5],[5,0,5,2],[9,0,9,2],[13,0,13,2],[22,0,22,2],[27,0,27,2],[31,0,31,2],[36,0,36,2],[41,0,41,2]]}
["PRIMER SET DE INPUTS",null,"UNIDADES","Perforación única","Multiples perforaciones"]
["Calor inyectado/absorbido"]
["Carga máxima al terreno por hora","qh","W",{"$f":"'BOMBA DE CALOR'!C8*1000","v":{"v":7115.012853470437,"d":"7115"}},{"$f":"D3","v":{"v":7115.012853470437,"d":"7115"}},"Convención de signos:\n+: Calor inyectado al terreno\n-: Calor absorbido del terreno"]
["Carga máxima al terreno por mes","qm","W",{"$f":"'BOMBA DE CALOR'!C9*1000","v":{"v":3053.212365591398,"d":"3053"}},{"$f":"D4","v":{"v":3053.212365591398,"d":"3053"}}]
["Carga al terreno por año","qy","W",{"$f":"'BOMBA DE CALOR'!C10*1000","v":{"v":712.4372146118723,"d":"712"}},{"$f":"D5","v":{"v":712.4372146118723,"d":"712"}}]
["Propiedades del terreno"]
["Conductividad Térmica","k","W.m-1K-1",{"$f":"TERRENO!B5","v":2.423},{"$f":"D7","v":2.423}]
["Difusividad Térmica","α","m2.día-1",{"$f":"TERRENO!B7","v":{"v":0.07823139013452914,"d":"0.078"}},{"$f":"D8","v":{"v":0.07823139013452914,"d":"0.078"}},"<- Aviso: α debe estar entre el rango 0,025 y 0,2 m²/day"]
["Temperatura imperturbable del terreno","Tg","°C",{"$f":"TERRENO!B4","v":19.9},{"$f":"D9","v":19.9}]
["Propiedades del fluido"]
{"$rows_left_out":61}
{"sheet":"DATOS TUBERIAS","index":11,"n_rows":130,"n_cols":8,"rows_kept":130}
[null,"Material","Tipo","Presión\n(Bar)","Diam Nominal\n(Pul)","DN=Do Exterior\n(mm)","Di Interior\n(mm)","Kp\n(W/m°K)"]
[{"$f":"CONCATENATE(B2,C2,\"PN\",D2,E2)","v":"PolietilenoPE32PN43/4''"},"Polietileno","PE32",4,"3/4''",20,17.6,0.40678]
[{"$f":"CONCATENATE(B3,C3,\"PN\",D3,E3)","v":"PolietilenoPE32PN41''"},"Polietileno","PE32",4,"1''",25,21,0.40678]
["PolietilenoPE32PN41 1/4''","Polietileno","PE32",4,"1 1/4''",32,28,0.40678]
["PolietilenoPE32PN41 1/2''","Polietileno","PE32",4,"1 1/2''",40,35.2,0.40678]
["PolietilenoPE32PN42''","Polietileno","PE32",4,"2''",50,44,0.40678]
["PolietilenoPE32PN42 1/2''","Polietileno","PE32",4,"2 1/2''",63,55.4,0.40678]
["PolietilenoPE32PN63/4''","Polietileno","PE32",6,"3/4''",20,16,0.40678]
["PolietilenoPE32PN61''","Polietileno","PE32",6,"1''",25,20.4,0.40678]
["PolietilenoPE32PN61 1/4''","Polietileno","PE32",6,"1 1/4''",32,26.2,0.40678]
{"$rows_left_out":121}
{"sheet":"DATOS FLUIDOS","index":12,"n_rows":33,"n_cols":7,"rows_kept":33,"merged":[[16,0,16,6],[25,0,25,6]]}
["Tipo","T° Media\n°C","Punto Congelamiento\n°C","Densidad\nkg/m3","Capacidad Térmica\nJ/kg°K","Conductividad\nW/m°K","Viscosidad\nPa s"]
["Agua Pura",20,0,998.1,4173,0.5929,0.001002]
["Agua/Etilenglicol",{"$f":"B8-273.15","v":32},{"$f":"B15-273.15","v":0},{"$f":"B10","v":{"v":995.007128202877,"d":"995.0"}},{"$f":"B11*1000","v":{"v":4197.974372062434,"d":"4198.0"}},{"$f":"B12","v":{"v":0.6082432515064661,"d":"0.608"}},{"$f":"B13","v":{"v":7.5139959667272136E-4,"d":"0.000751"}}]
["Agua/Propilenglicol",{"$f":"C8-273.15","v":32},{"$f":"C15-273.15","v":0},{"$f":"C10","v":{"v":994.5227977925492,"d":"994.5"}},{"$f":"C11*1000","v":{"v":4220.01551381013,"d":"4220.0"}},{"$f":"C12","v":{"v":0.6190781802152782,"d":"0.619"}},{"$f":"C13","v":{"v":7.7895354146462149E-4,"d":"0.000779"}}]
[]
["Mezcla con","Etilenglicol","Propilenglico"]
["% Peso de la solución",{"$f":"'TUBERIA Y FLUIDO'!E4/100","v":0},{"$f":"'TUBERIA Y FLUIDO'!E4/100","v":0}]
["Temperatura media del fluido",{"$f":"'TUBERIA Y FLUIDO'!E5+273.15","v":305.15},{"$f":"'TUBERIA Y FLUIDO'!E5+273.15","v":305.15},"[K]"]
[]
["Densidad",{"$f":"B20+B21*B7+B22*273.15/B8+B23*B7*273.15/B8+B24*(273.15/B8)^2","v":995.007128202877},{"$f":"B29+B30*C7+B31*273.15/C8+B32*C7*273.15/C8+B33*(273.15/C8)^2","v":994.5227977925492},"[kg/m3]"]
{"$rows_left_out":24}
{"sheet":"PROPIEDAD FLUIDOS","index":13,"n_rows":54,"n_cols":11,"rows_kept":54}
["Forced Convection Heat Transfer Coefficient Correlations   (S.I. units)",{"$nulls":8},"      Equations for Forced Convection Flow inside Pipes"]
[]
["1. Turbulent Flow Inside a Circular Tube"]
[]
["Inputs",{"$nulls":4},"Calculations"]
[]
["Fluid =",{"$f":"'TUBERIA Y FLUIDO'!E3","v":"Agua Pura"},{"$nulls":3},"Reynolds Number, Re =",null,{"$f":"C13*C16*C18/C20","v":{"v":17524.461381157435,"d":"17,524"}}]
[]
["Ave. Fluid Temp, Tb =",null,{"$f":"VLOOKUP(B7,'DATOS FLUIDOS'!$A$2:$G$4,2,FALSE)","v":20},"oC",null,"Prandtl Number, Pr =",null,{"$f":"C20*C22/C28","v":{"v":7.052362961713613,"d":"7.05"}}]
[]
{"$rows_left_out":45}
{"sheet":"DATOS SUELOS","index":14,"n_rows":42,"n_cols":6,"rows_kept":42,"merged":[[0,2,0,4]]}
[null,"TIPO DE ROCA","Conductividad térmica\n(W/mK)",null,null,"Capacidad térmica volumétrica (MJ/m3K)"]
[null,null,"Mín.","Valor típico","Máx."]
[null,"DEFINIDO POR EL USUARIO"]
[{"$f":"CONCATENATE($B$3,\" - \",B4)","v":"DEFINIDO POR EL USUARIO - Maxey Elementary School"},"Maxey Elementary School",null,2.25,null,2.877]
[{"$f":"CONCATENATE($B$3,\" - \",B5)","v":"DEFINIDO POR EL USUARIO - Fort Polk"},"Fort Polk",null,2.423,null,2.676]
[{"$f":"CONCATENATE($B$3,\" - \",B6)","v":"DEFINIDO POR EL USUARIO - "}]
[null,"ROCAS MAGMÁTICAS"]
[{"$f":"CONCATENATE($B$7,\" - \",B8)","v":"ROCAS MAGMÁTICAS - Basalto"},"Basalto",1.3,1.7,2.3,2.45]
["ROCAS MAGMÁTICAS - Diorita","Diorita",2,2.6,2.9,2.9]
["ROCAS MAGMÁTICAS - Grabo","Grabo",1.7,1.9,2.5,2.6]
{"$rows_left_out":33}
{"sheet":"INGRESO TERRENO","index":15,"n_rows":5,"n_cols":3,"rows_kept":5,"merged":[[0,0,0,3]]}
["INGRESO TIPO SUELO"]
[]
["Tipo Suelo"]
["Conductividad Térmica",null,"W/m°K"]
["Capacidad Térmica",null,"MJ/m3°K"]

{"sheet":"coefficients","index":16,"n_rows":40,"n_cols":8,"rows_kept":40,"merged":[[2,6,2,7]]}
[]
[null,"Coefficients for f6h, f1m, f10y functions",{"$nulls":4},"Coefficients for Tp correlation"]
[null,null,"f6h","f1m","f10y",null,"Tp function's coefficients"]
[null,"a0",0.6619352,0.4132728,0.3057646,null,"b0",{"v":7.8189,"d":"7.8189E+00"}]
[null,"a1",-4.815693,0.2912981,0.08987446,null,"b1",{"v":-64.27,"d":"-6.4270E+01"}]
[null,"a2",15.03571,0.07589286,-0.09151786,null,"b2",{"v":153.87,"d":"1.5387E+02"}]
[null,"a3",{"v":-0.09879421000000001,"d":"-0.09879421"},0.1563978,{"v":-0.038724510000000004,"d":"-0.03872451"},null,"b3",{"v":-84.809,"d":"-8.4809E+01"}]
[null,"a4",0.02917889,-0.2289355,0.1690853,null,"b4",{"v":3.461,"d":"3.4610E+00"}]
[null,"a5",0.1138498,{"v":-0.004927554000000001,"d":"-0.004927554"},-0.02881681,null,"b5",{"v":-0.9475300000000001,"d":"-9.4753E-01"}]
[null,"a6",0.005610933,-0.002694979,-0.002886584,null,"b6",{"v":-0.060416,"d":"-6.0416E-02"}]
{"$rows_left_out":31}
{"sheet":"Instructions","index":17,"n_rows":12,"n_cols":5,"rows_kept":12,"merged":[[1,2,2,2],[1,4,5,4]]}
["Instructions for using the \"bh_sizing\" worksheet, v. 1"]
["1) Fill in the coloured cells (D3 to D21 or E3 to E21) of the section \"1st set of inputs\" with your input parameters",null,"Single  borehole design",null,"Multiple boreholes design"]
["2) The results of the calculations with Tp = 0 (without taking into account the thermal interference among boreholes) are given in section \"1st set of results\".  For single borehole designs, calculations stop here and the value in cell D35 is the required borehole depth. For multiple boreholes, the length given in cell D35 should be regarded as a first approximation of the total borehole length."]
["3) To size a borefield by taking into account the thermal interference, determine the three parameters B (borehole spacing) , NB (number of boreholes) and A (borefield aspect ratio). Use the  1st set of results, which gives a first approximation of the final value of the borehole length, to estimate these three parameters."]
["4) Fill in the coloured cells (E38, E39, E40) of the section \"2nd set of inputs\" with the values of B, NB, and A."]
["5) The final results are given at the end of the section \"final results\", i.e, cells E69 and E70."]
[]
[]
[]
[]
{"$rows_left_out":2}